program: Orca
programVersion: 5.0.2
elementType: O O O C C C C C C C C C C C C C C C C C C C H H H H H H H H H H H H H H H H H H H H H H H H H H
charge: 0
multiplicity: 1
keywords: wb97x-d3
keywords: def2-TZVPP
keywords: def2/J RIJCOSX
keywords: DEFGRID2
keywords: scfconv7
keywords: smallprint printgap noloewdin
keywords: NOSOSCF
formula: C19H26O3
InChI: InChI=1/C19H26O3/c1-7-8-13-12(4)16(10-15(13)20)22-18(21)17-14(9-11(2)3)19(17,5)6/h7,9,14,16-17H,1,8,10H2,2-6H3
48 atoms
O  -0.117717 0.674976 0.211798
O  1.304656 0.657377 -1.512862
O  -3.594047 -2.030397 -1.075127
C  3.486441 1.316281 0.621385
C  3.415565 -0.1695 0.549436
C  2.133356 0.642964 0.739968
C  3.846378 2.125417 -0.600117
C  4.009412 1.919663 1.904881
C  3.706464 -0.9204 -0.6966
C  1.114145 0.667466 -0.326703
C  3.192575 -2.107756 -1.015092
C  -1.217146 0.621057 -0.693146
C  2.18325 -2.822414 -0.170584
C  3.577236 -2.811018 -2.280751
C  -1.511186 -0.783778 -1.210807
C  -2.450673 1.023811 0.071662
C  -3.425585 0.110803 -0.026195
C  -2.950264 -1.048375 -0.806651
C  -2.488102 2.321117 0.792787
C  -4.799325 0.157643 0.565539
C  -4.777243 -0.114593 2.040164
C  -5.249875 0.706613 2.967754
H  3.709063 -0.686235 1.460247
H  1.713699 0.621737 1.739162
H  3.441313 3.135677 -0.518259
H  4.932374 2.213775 -0.673329
H  3.478533 1.697356 -1.527806
H  5.097813 1.998551 1.874373
H  3.6074 2.922208 2.061006
H  3.748167 1.31795 2.776601
H  4.415127 -0.467532 -1.382203
H  -1.042673 1.320702 -1.516824
H  2.5497 -3.807728 0.128194
H  1.26592 -2.996558 -0.739954
H  1.915163 -2.277048 0.732587
H  4.308186 -2.245731 -2.857199
H  2.702945 -2.972671 -2.915733
H  4.00086 -3.796744 -2.073611
H  -0.859546 -1.528309 -0.747951
H  -1.385741 -0.87918 -2.289309
H  -2.163519 3.136625 0.142508
H  -3.480927 2.553141 1.17211
H  -1.803325 2.304027 1.642949
H  -5.413505 -0.596516 0.065517
H  -5.268034 1.126137 0.373498
H  -4.333854 -1.05973 2.338672
H  -5.208755 0.458296 4.019372
H  -5.701222 1.658453 2.711851
totalener: -965.40251359 hartree
nucrepener: 1826.87505843 hartree
electener: -2792.27757202 hartree
oneelecener: -4939.98764630 hartree
twoeener: 2147.71007428 hartree
kineticenergy: 961.04310365 hartree
xcener: -95.137192791715 hartree
chargesum: -0.0000000
charge: -0.282594 -0.371194 -0.329429 0.132325 -0.056863 -0.082982 -0.284249 -0.242171 -0.177564 0.296492 0.010905 0.216719 -0.276471 -0.208844 -0.136125 -0.064500 -0.037293 0.230552 -0.240078 -0.112161 -0.141250 -0.221055 0.098207 0.084324 0.084766 0.089309 0.108614 0.089110 0.090100 0.071558 0.083730 0.087715 0.103260 0.086171 0.087088 0.077545 0.088874 0.083705 0.075332 0.100233 0.100143 0.083848 0.109513 0.104663 0.089221 0.117894 0.102835 0.080071
qa: -0.2826 -0.3712 -0.3294 0.1323 -0.0569 -0.0830 -0.2842 -0.2422 -0.1776 0.2965 0.0109 0.2167 -0.2765 -0.2088 -0.1361 -0.0645 -0.0373 0.2306 -0.2401 -0.1122 -0.1412 -0.2211 0.0982 0.0843 0.0848 0.0893 0.1086 0.0891 0.0901 0.0716 0.0837 0.0877 0.1033 0.0862 0.0871 0.0775 0.0889 0.0837 0.0753 0.1002 0.1001 0.0838 0.1095 0.1047 0.0892 0.1179 0.1028 0.0801
va: 2.1091 2.1119 2.1747 3.7310 3.8963 3.8125 3.9121 3.9034 3.9018 4.1738 3.7232 3.8052 3.9457 3.9426 3.8583 3.7272 3.4211 4.1193 3.9542 3.8765 3.8368 3.9549 1.0041 1.0307 1.0048 0.9982 1.0173 1.0046 1.0049 1.0074 1.0105 1.0210 1.0031 1.0003 1.0061 1.0111 0.9994 0.9984 1.0403 1.0259 1.0035 1.0124 1.0054 1.0269 1.0037 1.0103 1.0112 1.0149
dispcorr: -0.023678159 hartree
energy: -965.426191743950
dipole: 13.52082 -12.83756 0.68326 2.78094 -1.72071 1.06023 5.81867 -4.94477 0.87390
magnitude: 1.53448 au
magnitude: 3.90034 debye
