program: Orca
programVersion: 5.0.2
elementType: O O O C C C C C C C C C C C C C C C C C C C H H H H H H H H H H H H H H H H H H H H H H H H H H
charge: 0
multiplicity: 1
keywords: wb97x-d3
keywords: def2-TZVPP
keywords: def2/J RIJCOSX
keywords: DEFGRID2
keywords: scfconv7
keywords: smallprint printgap noloewdin
keywords: NOSOSCF
formula: C19H26O3
InChI: InChI=1/C19H26O3/c1-7-8-13-12(4)16(10-15(13)20)22-18(21)17-14(9-11(2)3)19(17,5)6/h7,9,14,16-17H,1,8,10H2,2-6H3
48 atoms
O  -0.292202 0.669305 0.196237
O  1.100206 0.657037 -1.547096
O  -4.072831 -1.383979 -1.518171
C  3.33643 1.047262 0.602397
C  3.190048 -0.43911 0.501004
C  1.951601 0.43795 0.693551
C  3.762086 1.861928 -0.59387
C  3.880049 1.589418 1.90431
C  3.451027 -1.195196 -0.73679
C  0.92628 0.596504 -0.357771
C  4.127909 -2.343937 -0.824455
C  -1.399034 0.84184 -0.686504
C  4.745102 -3.081813 0.325713
C  4.328132 -3.006895 -2.155303
C  -1.836235 -0.43481 -1.396686
C  -2.584762 1.25348 0.146556
C  -3.661486 0.498495 -0.105909
C  -3.313892 -0.562491 -1.071306
C  -2.478441 2.40375 1.078911
C  -5.035143 0.619222 0.474924
C  -5.113378 0.010941 1.84363
C  -5.467285 0.665091 2.941285
H  3.441729 -0.970348 1.412051
H  1.529596 0.405384 1.691304
H  3.411997 2.891235 -0.496805
H  4.851948 1.887314 -0.642408
H  3.396011 1.47894 -1.540607
H  3.534982 2.610092 2.078972
H  3.573931 0.985227 2.759438
H  4.971209 1.605828 1.885723
H  3.061751 -0.776868 -1.656158
H  -1.161225 1.631747 -1.407007
H  4.332643 -4.091198 0.400856
H  4.608199 -2.597336 1.289987
H  5.820941 -3.198613 0.170533
H  3.858509 -2.450727 -2.965476
H  3.91198 -4.01762 -2.157708
H  5.391383 -3.108292 -2.388303
H  -1.306215 -1.308383 -1.011113
H  -1.669059 -0.410521 -2.472796
H  -2.04244 3.271412 0.579445
H  -3.443783 2.689286 1.490609
H  -1.820896 2.157808 1.914312
H  -5.73535 0.106487 -0.190453
H  -5.344195 1.666288 0.515811
H  -4.855316 -1.041423 1.908703
H  -5.50953 0.175998 3.904618
H  -5.736493 1.714762 2.918948
totalener: -965.40489524 hartree
nucrepener: 1781.61105079 hartree
electener: -2747.01594603 hartree
oneelecener: -4849.35417868 hartree
twoeener: 2102.33823264 hartree
kineticenergy: 961.03791185 hartree
xcener: -95.138171144627 hartree
chargesum: -0.0000000
charge: -0.284391 -0.394869 -0.329197 0.090375 0.030845 -0.078464 -0.254597 -0.240574 -0.221115 0.330270 -0.053901 0.216217 -0.241640 -0.204198 -0.148732 -0.060799 -0.032542 0.236054 -0.241070 -0.117956 -0.139883 -0.219641 0.086998 0.080542 0.085256 0.087451 0.102881 0.088119 0.070960 0.090400 0.110440 0.087863 0.088215 0.076445 0.086324 0.081665 0.082882 0.082131 0.086441 0.097793 0.099633 0.083427 0.109568 0.104851 0.088572 0.119785 0.102907 0.078263
qa: -0.2844 -0.3949 -0.3292 0.0904 0.0308 -0.0785 -0.2546 -0.2406 -0.2211 0.3303 -0.0539 0.2162 -0.2416 -0.2042 -0.1487 -0.0608 -0.0325 0.2361 -0.2411 -0.1180 -0.1399 -0.2196 0.0870 0.0805 0.0853 0.0875 0.1029 0.0881 0.0710 0.0904 0.1104 0.0879 0.0882 0.0764 0.0863 0.0817 0.0829 0.0821 0.0864 0.0978 0.0996 0.0834 0.1096 0.1049 0.0886 0.1198 0.1029 0.0783
va: 2.1244 2.0973 2.1717 3.7329 3.7921 3.8875 3.9216 3.9104 3.8984 4.1610 3.8169 3.8021 3.9460 3.9383 3.8787 3.7282 3.4149 4.1021 3.9573 3.8838 3.8352 3.9572 1.0103 1.0296 1.0021 1.0023 1.0192 1.0050 1.0081 1.0041 1.0260 1.0189 0.9991 1.0168 0.9996 1.0127 0.9984 0.9981 1.0299 1.0285 1.0032 1.0122 1.0045 1.0258 1.0031 1.0102 1.0110 1.0150
dispcorr: -0.021788119 hartree
energy: -965.426683360168
dipole: 19.49937 -18.53881 0.96056 0.45374 0.45775 0.91149 8.00642 -6.84014 1.16628
magnitude: 1.76457 au
magnitude: 4.48517 debye
