program: Orca
programVersion: 5.0.2
elementType: O O O C C C C C C C C C C C C C C C C C C C H H H H H H H H H H H H H H H H H H H H H H H H H H
charge: 0
multiplicity: 1
keywords: wb97x-d3
keywords: def2-TZVPP
keywords: def2/J RIJCOSX
keywords: DEFGRID2
keywords: scfconv7
keywords: smallprint printgap noloewdin
keywords: NOSOSCF
formula: C19H26O3
InChI: InChI=1/C19H26O3/c1-7-8-13-12(4)16(10-15(13)20)22-18(21)17-14(9-11(2)3)19(17,5)6/h7,9,14,16-17H,1,8,10H2,2-6H3
48 atoms
O  -0.010307 0.716442 0.214489
O  1.310583 0.207691 -1.513961
O  -3.415071 -2.39067 -0.300681
C  3.59952 1.535941 0.112436
C  3.536048 0.139076 0.624832
C  2.25995 0.982047 0.552365
C  3.896033 1.808366 -1.34198
C  4.182948 2.581481 1.035617
C  3.748631 -1.042905 -0.24584
C  1.186558 0.598364 -0.384646
C  3.234207 -2.252912 -0.02784
C  -1.15507 0.368505 -0.558753
C  2.314033 -2.562939 1.112963
C  3.531548 -3.402719 -0.940152
C  -1.375121 -1.132478 -0.714894
C  -2.368906 0.867438 0.181327
C  -3.287805 -0.092849 0.345134
C  -2.795539 -1.359833 -0.230077
C  -2.457512 2.291074 0.593682
C  -4.650142 0.023452 0.954408
C  -5.632019 0.62802 -0.004443
C  -6.326361 1.734563 0.22262
H  3.881141 0.008314 1.647638
H  1.892903 1.349002 1.503999
H  3.477569 2.770977 -1.64029
H  4.976685 1.86247 -1.488245
H  3.49933 1.056197 -2.016577
H  3.783483 3.571331 0.808182
H  3.967846 2.369632 2.083849
H  5.26787 2.626823 0.925005
H  4.3911 -0.905764 -1.109198
H  -1.090248 0.858629 -1.536426
H  2.109205 -1.700883 1.744722
H  2.72678 -3.352797 1.745376
H  1.356883 -2.938748 0.74073
H  2.614225 -3.789499 -1.390647
H  3.986522 -4.233083 -0.394413
H  4.206377 -3.12031 -1.746912
H  -0.687454 -1.703266 -0.086334
H  -1.240859 -1.486062 -1.736332
H  -2.283652 2.948663 -0.261075
H  -3.430384 2.538123 1.011927
H  -1.690111 2.528172 1.332368
H  -4.612691 0.613977 1.8726
H  -4.989043 -0.977671 1.234119
H  -5.757135 0.101797 -0.945556
H  -7.022157 2.127267 -0.505986
H  -6.231876 2.287829 1.149665
totalener: -965.40271133 hartree
nucrepener: 1822.85915820 hartree
electener: -2788.26186953 hartree
oneelecener: -4931.93171760 hartree
twoeener: 2143.66984808 hartree
kineticenergy: 961.04857201 hartree
xcener: -95.138729774681 hartree
chargesum: -0.0000000
charge: -0.283679 -0.370559 -0.330957 0.132320 -0.059598 -0.078444 -0.281440 -0.242395 -0.177075 0.298593 0.003741 0.209972 -0.272794 -0.206709 -0.136862 -0.061493 -0.039688 0.240615 -0.236292 -0.117562 -0.142462 -0.221303 0.096891 0.081900 0.084987 0.088742 0.107822 0.090509 0.070492 0.089167 0.084067 0.088135 0.087049 0.104390 0.085801 0.088655 0.083718 0.077714 0.075290 0.101642 0.095800 0.083988 0.109904 0.090268 0.102859 0.121149 0.103372 0.079764
qa: -0.2837 -0.3706 -0.3310 0.1323 -0.0596 -0.0784 -0.2814 -0.2424 -0.1771 0.2986 0.0037 0.2100 -0.2728 -0.2067 -0.1369 -0.0615 -0.0397 0.2406 -0.2363 -0.1176 -0.1425 -0.2213 0.0969 0.0819 0.0850 0.0887 0.1078 0.0905 0.0705 0.0892 0.0841 0.0881 0.0870 0.1044 0.0858 0.0887 0.0837 0.0777 0.0753 0.1016 0.0958 0.0840 0.1099 0.0903 0.1029 0.1211 0.1034 0.0798
va: 2.1066 2.1157 2.1716 3.7390 3.8971 3.8129 3.9115 3.9030 3.8974 4.1745 3.7315 3.8222 3.9451 3.9412 3.8638 3.7288 3.4106 4.1034 3.9523 3.8870 3.8313 3.9565 1.0045 1.0302 1.0051 0.9979 1.0183 1.0047 1.0073 1.0048 1.0117 1.0190 1.0071 1.0020 0.9999 0.9995 0.9981 1.0111 1.0400 1.0281 1.0030 1.0146 1.0061 1.0028 1.0259 1.0106 1.0111 1.0146
dispcorr: -0.023689532 hartree
energy: -965.426400858954
dipole: 12.52925 -11.82738 0.70187 4.84881 -3.55862 1.29019 3.31680 -2.61855 0.69825
magnitude: 1.62627 au
magnitude: 4.13366 debye
