program: Orca
programVersion: 5.0.2
elementType: O O O C C C C C C C C C C C C C C C C C C C H H H H H H H H H H H H H H H H H H H H H H H H H H
charge: 0
multiplicity: 1
keywords: wb97x-d3
keywords: def2-TZVPP
keywords: def2/J RIJCOSX
keywords: DEFGRID2
keywords: scfconv7
keywords: smallprint printgap noloewdin
keywords: NOSOSCF
formula: C19H26O3
InChI: InChI=1/C19H26O3/c1-7-8-13-12(4)16(10-15(13)20)22-18(21)17-14(9-11(2)3)19(17,5)6/h7,9,14,16-17H,1,8,10H2,2-6H3
48 atoms
O  -0.090459 0.918692 -0.0214
O  1.336941 0.503848 -1.689379
O  -3.550236 -1.982005 -0.990453
C  3.576239 1.412215 0.257506
C  3.335779 -0.015986 0.606309
C  2.156268 0.95835 0.52162
C  4.032166 1.798401 -1.128135
C  4.16741 2.293372 1.334169
C  3.519843 -1.116136 -0.371494
C  1.142873 0.774008 -0.535153
C  2.883448 -2.286697 -0.336117
C  -1.186297 0.703008 -0.907673
C  1.838565 -2.628075 0.681277
C  3.165215 -3.356712 -1.345443
C  -1.456464 -0.767851 -1.207388
C  -2.429663 1.194002 -0.21257
C  -3.393558 0.264734 -0.185979
C  -2.907066 -0.979919 -0.814049
C  -2.491239 2.576133 0.326685
C  -4.766305 0.375855 0.382751
C  -4.839977 0.259554 1.878987
C  -3.819969 0.131536 2.715776
H  3.570029 -0.285672 1.633208
H  1.738757 1.261671 1.474861
H  3.736519 2.824497 -1.352384
H  5.121982 1.754814 -1.177231
H  3.631196 1.163931 -1.912051
H  5.257145 2.234175 1.321085
H  3.888873 3.337405 1.181454
H  3.834068 2.003393 2.331538
H  4.24923 -0.95342 -1.157987
H  -1.021345 1.271342 -1.82926
H  0.906115 -2.919876 0.190681
H  1.615403 -1.806849 1.359847
H  2.145069 -3.486757 1.284129
H  3.940851 -3.059728 -2.04988
H  2.266506 -3.597449 -1.918378
H  3.485548 -4.282839 -0.86157
H  -0.822806 -1.420683 -0.602694
H  -1.285861 -1.036491 -2.249213
H  -1.789376 2.697029 1.153527
H  -2.206788 3.304358 -0.436007
H  -3.483579 2.828115 0.694627
H  -5.393716 -0.404395 -0.057664
H  -5.224996 1.324361 0.0834
H  -5.84684 0.285714 2.283876
H  -3.983436 0.055043 3.781862
H  -2.792024 0.095526 2.378158
totalener: -965.40243665 hartree
nucrepener: 1848.11515869 hartree
electener: -2813.51759533 hartree
oneelecener: -4982.49604278 hartree
twoeener: 2168.97844745 hartree
kineticenergy: 961.05001345 hartree
xcener: -95.140945810476 hartree
chargesum: -0.0000000
charge: -0.285320 -0.369935 -0.325461 0.135780 -0.059069 -0.085675 -0.281982 -0.242224 -0.175990 0.298128 0.007633 0.239305 -0.284905 -0.207640 -0.145163 -0.086671 -0.065104 0.250598 -0.243503 -0.083925 -0.156841 -0.203113 0.096840 0.083125 0.084995 0.088989 0.107507 0.089218 0.090000 0.070745 0.084137 0.090491 0.088265 0.088894 0.107725 0.077482 0.089460 0.084070 0.073691 0.101289 0.107269 0.102929 0.092853 0.098245 0.085749 0.102511 0.101131 0.083463
qa: -0.2853 -0.3699 -0.3255 0.1358 -0.0591 -0.0857 -0.2820 -0.2422 -0.1760 0.2981 0.0076 0.2393 -0.2849 -0.2076 -0.1452 -0.0867 -0.0651 0.2506 -0.2435 -0.0839 -0.1568 -0.2031 0.0968 0.0831 0.0850 0.0890 0.1075 0.0892 0.0900 0.0707 0.0841 0.0905 0.0883 0.0889 0.1077 0.0775 0.0895 0.0841 0.0737 0.1013 0.1073 0.1029 0.0929 0.0982 0.0857 0.1025 0.1011 0.0835
va: 2.1048 2.1154 2.1818 3.7358 3.8945 3.8220 3.9110 3.9028 3.8972 4.1765 3.7189 3.7826 3.9460 3.9414 3.8638 3.6994 3.4442 4.0910 3.9584 3.8506 3.8868 3.9298 1.0044 1.0297 1.0051 0.9978 1.0185 1.0047 1.0049 1.0072 1.0116 1.0197 0.9988 1.0064 1.0014 1.0112 0.9998 0.9979 1.0424 1.0280 1.0038 1.0023 1.0058 1.0245 0.9984 1.0091 1.0112 1.0252
dispcorr: -0.024420261 hartree
energy: -965.426856906578
dipole: 13.80190 -13.25580 0.54610 1.90258 -0.67256 1.23003 6.59312 -5.82367 0.76945
magnitude: 1.55024 au
magnitude: 3.94039 debye
