program: Orca
programVersion: 5.0.2
elementType: O O O C C C C C C C C C C C C C C C C C C C H H H H H H H H H H H H H H H H H H H H H H H H H H
charge: 0
multiplicity: 1
keywords: wb97x-d3
keywords: def2-TZVPP
keywords: def2/J RIJCOSX
keywords: DEFGRID2
keywords: scfconv7
keywords: smallprint printgap noloewdin
keywords: NOSOSCF
formula: C19H26O3
InChI: InChI=1/C19H26O3/c1-7-8-13-12(4)16(10-15(13)20)22-18(21)17-14(9-11(2)3)19(17,5)6/h7,9,14,16-17H,1,8,10H2,2-6H3
48 atoms
O  -0.146427 0.763852 0.368523
O  1.215854 1.048558 -1.378995
O  -3.645498 -1.605867 -1.421515
C  3.513948 1.181047 0.709122
C  3.33135 -0.265465 0.407029
C  2.12105 0.590184 0.79554
C  3.884058 2.157219 -0.380652
C  4.135512 1.527213 2.043144
C  3.489085 -0.826513 -0.957225
C  1.066247 0.838244 -0.20548
C  2.913087 -1.947724 -1.390022
C  -1.273927 0.911995 -0.492569
C  1.976879 -2.767297 -0.556347
C  3.149234 -2.462051 -2.776721
C  -1.578319 -0.332584 -1.320537
C  -2.482517 1.102702 0.385897
C  -3.447305 0.213584 0.119402
C  -2.997469 -0.713675 -0.938366
C  -2.514507 2.194717 1.391207
C  -4.786677 0.092814 0.760358
C  -4.77692 -0.538773 2.123884
C  -3.713287 -0.947793 2.801273
H  3.626988 -0.941265 1.205562
H  1.742013 0.433994 1.798898
H  3.559743 3.164151 -0.112833
H  4.969723 2.183039 -0.493431
H  3.448216 1.918659 -1.34571
H  3.865442 0.810251 2.819705
H  5.224257 1.534513 1.96704
H  3.818787 2.515907 2.379605
H  4.137843 -0.285827 -1.638131
H  -1.127965 1.789766 -1.130661
H  1.801648 -2.346126 0.431641
H  2.356172 -3.78382 -0.425785
H  1.007611 -2.864775 -1.052971
H  3.555189 -3.476538 -2.759382
H  3.840693 -1.831859 -3.334148
H  2.212917 -2.509122 -3.338177
H  -0.903013 -1.155799 -1.077835
H  -1.49529 -0.162507 -2.393656
H  -2.300866 3.15845 0.923383
H  -3.476045 2.259556 1.895712
H  -1.748573 2.03915 2.152842
H  -5.437757 -0.497506 0.109116
H  -5.261503 1.076981 0.834337
H  -5.758823 -0.660685 2.570467
H  -3.817375 -1.395977 3.779695
H  -2.707158 -0.861231 2.411421
totalener: -965.40255817 hartree
nucrepener: 1845.49830399 hartree
electener: -2810.90086217 hartree
oneelecener: -4977.28403312 hartree
twoeener: 2166.38317095 hartree
kineticenergy: 961.04954474 hartree
xcener: -95.140760833517 hartree
chargesum: 0.0000000
charge: -0.286838 -0.372346 -0.325559 0.133704 -0.062367 -0.082781 -0.281645 -0.241833 -0.167540 0.299707 0.001039 0.243852 -0.275844 -0.207096 -0.145807 -0.087414 -0.065336 0.250554 -0.242627 -0.082337 -0.159216 -0.201624 0.096170 0.083361 0.084367 0.089675 0.106999 0.070792 0.089671 0.089759 0.083315 0.090599 0.086813 0.104526 0.086443 0.083256 0.077799 0.088627 0.074341 0.099221 0.102941 0.092420 0.107417 0.096905 0.086276 0.102574 0.101226 0.083863
qa: -0.2868 -0.3723 -0.3256 0.1337 -0.0624 -0.0828 -0.2816 -0.2418 -0.1675 0.2997 0.0010 0.2439 -0.2758 -0.2071 -0.1458 -0.0874 -0.0653 0.2506 -0.2426 -0.0823 -0.1592 -0.2016 0.0962 0.0834 0.0844 0.0897 0.1070 0.0708 0.0897 0.0898 0.0833 0.0906 0.0868 0.1045 0.0864 0.0833 0.0778 0.0886 0.0743 0.0992 0.1029 0.0924 0.1074 0.0969 0.0863 0.1026 0.1012 0.0839
va: 2.1063 2.1124 2.1813 3.7392 3.8961 3.8231 3.9107 3.9028 3.8927 4.1765 3.7328 3.7729 3.9459 3.9418 3.8726 3.6967 3.4438 4.0914 3.9558 3.8493 3.8870 3.9290 1.0043 1.0291 1.0048 0.9979 1.0187 1.0072 1.0046 1.0051 1.0117 1.0204 1.0066 1.0022 0.9999 0.9983 1.0112 0.9996 1.0401 1.0271 1.0023 1.0061 1.0046 1.0248 0.9983 1.0092 1.0111 1.0257
dispcorr: -0.024227892 hartree
energy: -965.426786066051
dipole: 14.30662 -13.72798 0.57864 -0.17616 1.06330 0.88714 5.95509 -4.84602 1.10908
magnitude: 1.53359 au
magnitude: 3.89808 debye
