program: Orca
programVersion: 5.0.2
elementType: O O O C C C C C C C C C C C C C C C C C C C H H H H H H H H H H H H H H H H H H H H H H H H H H
charge: 0
multiplicity: 1
keywords: wb97x-d3
keywords: def2-TZVPP
keywords: def2/J RIJCOSX
keywords: DEFGRID2
keywords: scfconv7
keywords: smallprint printgap noloewdin
keywords: NOSOSCF
formula: C19H26O3
InChI: InChI=1/C19H26O3/c1-7-8-13-12(4)16(10-15(13)20)22-18(21)17-14(9-11(2)3)19(17,5)6/h7,9,14,16-17H,1,8,10H2,2-6H3
48 atoms
O  -0.002182 0.831201 -0.048195
O  1.351514 -0.237068 -1.46921
O  -3.418331 -2.200351 0.57319
C  3.64266 1.466111 -0.244046
C  3.508913 0.296108 0.668178
C  2.269502 1.112894 0.29066
C  3.990142 1.26676 -1.698819
C  4.240599 2.727684 0.335477
C  3.70341 -1.101636 0.209064
C  1.208163 0.492016 -0.525354
C  3.130167 -2.172036 0.758498
C  -1.131418 0.246828 -0.692646
C  2.156651 -2.094366 1.894116
C  3.412916 -3.554282 0.255102
C  -1.379966 -1.207218 -0.302589
C  -2.355261 0.991604 -0.2255
C  -3.290324 0.168658 0.265912
C  -2.801128 -1.22485 0.231542
C  -2.436114 2.466779 -0.380593
C  -4.6510 0.512488 0.767391
C  -5.689582 0.701924 -0.301737
C  -5.494615 0.667166 -1.612209
H  3.818169 0.476725 1.694849
H  1.89176 1.764375 1.07037
H  3.621005 2.102584 -2.295543
H  5.075792 1.238897 -1.812711
H  3.580661 0.355227 -2.123077
H  3.87841 3.611499 -0.192503
H  3.997364 2.849362 1.391956
H  5.328418 2.711925 0.248458
H  4.384517 -1.25267 -0.621904
H  -1.021676 0.352367 -1.777262
H  1.218999 -2.590767 1.629482
H  1.921746 -1.073339 2.189337
H  2.540623 -2.617658 2.773872
H  4.132644 -3.552455 -0.562391
H  2.498103 -4.031357 -0.104842
H  3.806839 -4.192541 1.049938
H  -0.695459 -1.533878 0.483587
H  -1.262563 -1.902044 -1.133605
H  -2.232188 2.756589 -1.413824
H  -3.4168 2.854407 -0.113088
H  -1.684952 2.962279 0.236859
H  -4.611528 1.418408 1.381372
H  -4.989035 -0.281421 1.439662
H  -6.692671 0.88339 0.071747
H  -6.314789 0.814417 -2.300989
H  -4.521901 0.483297 -2.049895
totalener: -965.40214728 hartree
nucrepener: 1834.77956269 hartree
electener: -2800.18170997 hartree
oneelecener: -4955.83712910 hartree
twoeener: 2155.65541913 hartree
kineticenergy: 961.03755290 hartree
xcener: -95.138381734058 hartree
chargesum: -0.0000000
charge: -0.282977 -0.370278 -0.324938 0.132374 -0.058287 -0.081088 -0.281319 -0.241759 -0.177850 0.294209 0.010978 0.235543 -0.284763 -0.207915 -0.134665 -0.088125 -0.056947 0.244817 -0.244938 -0.089505 -0.154557 -0.202645 0.097707 0.084099 0.085156 0.088997 0.107267 0.090286 0.070959 0.088780 0.083751 0.086884 0.087375 0.088949 0.106741 0.078016 0.089239 0.083724 0.073485 0.100915 0.095796 0.092434 0.113827 0.086501 0.096485 0.102252 0.102575 0.082436
qa: -0.2830 -0.3703 -0.3249 0.1324 -0.0583 -0.0811 -0.2813 -0.2418 -0.1779 0.2942 0.0110 0.2355 -0.2848 -0.2079 -0.1347 -0.0881 -0.0569 0.2448 -0.2449 -0.0895 -0.1546 -0.2026 0.0977 0.0841 0.0852 0.0890 0.1073 0.0903 0.0710 0.0888 0.0838 0.0869 0.0874 0.0889 0.1067 0.0780 0.0892 0.0837 0.0735 0.1009 0.0958 0.0924 0.1138 0.0865 0.0965 0.1023 0.1026 0.0824
va: 2.1081 2.1142 2.1815 3.7365 3.8940 3.8106 3.9117 3.9024 3.9002 4.1787 3.7179 3.8013 3.9452 3.9415 3.8552 3.7033 3.4346 4.1000 3.9516 3.8526 3.8824 3.9369 1.0040 1.0300 1.0048 0.9980 1.0184 1.0047 1.0072 1.0050 1.0116 1.0227 0.9997 1.0064 1.0018 1.0110 0.9997 0.9980 1.0427 1.0266 1.0020 1.0068 1.0044 0.9984 1.0231 1.0091 1.0105 1.0202
dispcorr: -0.024191508 hartree
energy: -965.426338787152
dipole: 12.87998 -12.26806 0.61192 4.28950 -2.83333 1.45617 0.78546 -0.51332 0.27214
magnitude: 1.60280 au
magnitude: 4.07398 debye
