program: Orca
programVersion: 5.0.2
elementType: O O O C C C C C C C C C C C C C C C C C C C H H H H H H H H H H H H H H H H H H H H H H H H H H
charge: 0
multiplicity: 1
keywords: wb97x-d3
keywords: def2-TZVPP
keywords: def2/J RIJCOSX
keywords: DEFGRID2
keywords: scfconv7
keywords: smallprint printgap noloewdin
keywords: NOSOSCF
formula: C19H26O3
InChI: InChI=1/C19H26O3/c1-7-8-13-12(4)16(10-15(13)20)22-18(21)17-14(9-11(2)3)19(17,5)6/h7,9,14,16-17H,1,8,10H2,2-6H3
48 atoms
O  -0.135827 0.783421 0.424637
O  1.199183 1.170936 -1.324319
O  -3.613737 -1.530332 -1.491778
C  3.539798 1.16883 0.71511
C  3.32279 -0.262996 0.367529
C  2.137729 0.603505 0.810037
C  3.911991 2.174778 -0.346439
C  4.193767 1.454769 2.048028
C  3.436311 -0.779774 -1.017967
C  1.067464 0.898417 -0.161512
C  2.84141 -1.884397 -1.468091
C  -1.27665 0.959635 -0.413442
C  1.931582 -2.729906 -0.630426
C  3.029882 -2.353142 -2.878117
C  -1.564404 -0.236671 -1.315259
C  -2.480554 1.069583 0.485947
C  -3.4338 0.185913 0.16478
C  -2.976146 -0.66216 -0.95417
C  -2.522279 2.091402 1.561974
C  -4.768004 0.000589 0.801134
C  -4.745985 -0.764902 2.093991
C  -3.675457 -1.230232 2.722095
H  3.620327 -0.971368 1.136407
H  1.775686 0.418207 1.814785
H  3.61687 3.178591 -0.03648
H  4.995715 2.179598 -0.479097
H  3.452285 1.981398 -1.310387
H  3.904582 2.437731 2.423775
H  3.922128 0.717372 2.804684
H  5.280813 1.441439 1.951309
H  4.064729 -0.219658 -1.702047
H  -1.156464 1.878463 -0.996999
H  1.75267 -2.315634 0.360003
H  2.338641 -3.736496 -0.504664
H  0.961767 -2.852408 -1.120098
H  2.076107 -2.370903 -3.411186
H  3.424752 -3.371637 -2.908527
H  3.710821 -1.710771 -3.434549
H  -0.876711 -1.063077 -1.122841
H  -1.485365 -0.001059 -2.376157
H  -1.744178 1.901604 2.303178
H  -2.333693 3.088232 1.156726
H  -3.47886 2.102693 2.079873
H  -5.423912 -0.522927 0.099531
H  -5.242944 0.971434 0.977722
H  -5.724567 -0.940885 2.52976
H  -3.770634 -1.776404 3.650324
H  -2.672191 -1.0954 2.338691
totalener: -965.40257328 hartree
nucrepener: 1846.84526460 hartree
electener: -2812.24783789 hartree
oneelecener: -4979.97851857 hartree
twoeener: 2167.73068068 hartree
kineticenergy: 961.04814188 hartree
xcener: -95.140394176537 hartree
chargesum: -0.0000000
charge: -0.286707 -0.372344 -0.325194 0.134797 -0.063331 -0.082383 -0.280736 -0.241703 -0.166792 0.299877 -0.000898 0.243729 -0.278761 -0.206115 -0.144311 -0.083114 -0.071528 0.251455 -0.242704 -0.082713 -0.158853 -0.201086 0.095936 0.083142 0.084147 0.089802 0.106396 0.090095 0.070627 0.089728 0.083653 0.090788 0.087106 0.106219 0.086454 0.088417 0.083540 0.077795 0.073839 0.099432 0.107181 0.102828 0.091987 0.097620 0.085446 0.102445 0.101280 0.083512
qa: -0.2867 -0.3723 -0.3252 0.1348 -0.0633 -0.0824 -0.2807 -0.2417 -0.1668 0.2999 -0.0009 0.2437 -0.2788 -0.2061 -0.1443 -0.0831 -0.0715 0.2515 -0.2427 -0.0827 -0.1589 -0.2011 0.0959 0.0831 0.0841 0.0898 0.1064 0.0901 0.0706 0.0897 0.0837 0.0908 0.0871 0.1062 0.0865 0.0884 0.0835 0.0778 0.0738 0.0994 0.1072 0.1028 0.0920 0.0976 0.0854 0.1024 0.1013 0.0835
va: 2.1061 2.1130 2.1814 3.7416 3.8936 3.8229 3.9101 3.9021 3.8915 4.1784 3.7318 3.7740 3.9456 3.9418 3.8713 3.6978 3.4474 4.0899 3.9560 3.8484 3.8882 3.9292 1.0042 1.0291 1.0049 0.9977 1.0192 1.0051 1.0072 1.0046 1.0121 1.0199 1.0065 1.0016 0.9997 0.9997 0.9980 1.0112 1.0396 1.0275 1.0050 1.0017 1.0062 1.0238 0.9985 1.0091 1.0109 1.0258
dispcorr: -0.024266996 hartree
energy: -965.426840281205
dipole: 14.18888 -13.61801 0.57087 -0.81236 1.62357 0.81121 5.87927 -4.70999 1.16928
magnitude: 1.53335 au
magnitude: 3.89747 debye
