program: Orca
programVersion: 5.0.2
elementType: O O O C C C C C C C C C C C C C C C C C C C H H H H H H H H H H H H H H H H H H H H H H H H H H
charge: 0
multiplicity: 1
keywords: wb97x-d3
keywords: def2-TZVPP
keywords: def2/J RIJCOSX
keywords: DEFGRID2
keywords: scfconv7
keywords: smallprint printgap noloewdin
keywords: NOSOSCF
formula: C19H26O3
InChI: InChI=1/C19H26O3/c1-7-8-13-12(4)16(10-15(13)20)22-18(21)17-14(9-11(2)3)19(17,5)6/h7,9,14,16-17H,1,8,10H2,2-6H3
48 atoms
O  0.177695 1.25573 0.434205
O  0.658129 2.17575 2.41757
O  -3.390362 0.654647 -2.156189
C  3.149665 1.02665 -0.0568
C  2.745795 -0.257933 0.597478
C  2.382416 1.066005 1.252141
C  2.524069 1.4604 -1.360815
C  4.602703 1.430296 0.05419
C  1.731924 -1.193353 0.043454
C  1.001101 1.563389 1.440076
C  1.903634 -1.93895 -1.048365
C  -1.204496 1.613526 0.518433
C  3.138774 -1.901655 -1.895095
C  0.844286 -2.89299 -1.510697
C  -1.735405 1.90106 -0.880915
C  -1.995725 0.418504 0.998981
C  -2.85963 -0.017069 0.072986
C  -2.759926 0.811538 -1.142151
C  -1.754097 -0.159322 2.34623
C  -3.763233 -1.206491 0.135817
C  -3.038387 -2.435243 -0.330369
C  -2.775022 -3.491354 0.427144
H  3.548348 -0.762225 1.132825
H  2.980375 1.324343 2.118158
H  1.570727 0.982102 -1.561922
H  2.380814 2.542009 -1.383274
H  3.195619 1.205653 -2.18279
H  5.041532 1.126914 1.005495
H  5.19055 0.969254 -0.742651
H  4.716865 2.511959 -0.034124
H  0.809887 -1.318866 0.600703
H  -1.322293 2.461665 1.196277
H  2.899616 -1.606684 -2.919836
H  3.588917 -2.89568 -1.957093
H  3.896069 -1.21811 -1.5168
H  0.509181 -2.643281 -2.520729
H  -0.027211 -2.884534 -0.856852
H  1.22701 -3.915929 -1.555091
H  -0.948907 1.878855 -1.636033
H  -2.215368 2.878874 -0.949191
H  -1.657661 0.621768 3.100655
H  -2.548154 -0.841942 2.644007
H  -0.820256 -0.727816 2.36111
H  -4.628659 -1.027417 -0.507649
H  -4.139374 -1.356043 1.149896
H  -2.704695 -2.4206 -1.36342
H  -2.239934 -4.347227 0.038411
H  -3.091119 -3.546941 1.462013
totalener: -965.39808399 hartree
nucrepener: 1906.55908428 hartree
electener: -2871.95716827 hartree
oneelecener: -5099.02145708 hartree
twoeener: 2227.06428881 hartree
kineticenergy: 961.04273894 hartree
xcener: -95.139386523645 hartree
chargesum: -0.0000000
charge: -0.261459 -0.367337 -0.331001 0.075952 -0.017346 -0.091701 -0.267522 -0.246065 -0.162610 0.317761 -0.039585 0.193984 -0.249100 -0.177415 -0.144049 -0.085877 -0.037933 0.221910 -0.230663 -0.114793 -0.153731 -0.216325 0.100741 0.089326 0.091311 0.107450 0.085274 0.074678 0.081460 0.096193 0.058471 0.104678 0.093169 0.098393 0.079643 0.086836 0.045524 0.087227 0.088226 0.092052 0.126127 0.087112 0.103328 0.104986 0.091301 0.127486 0.105194 0.078716
qa: -0.2615 -0.3673 -0.3310 0.0760 -0.0173 -0.0917 -0.2675 -0.2461 -0.1626 0.3178 -0.0396 0.1940 -0.2491 -0.1774 -0.1440 -0.0859 -0.0379 0.2219 -0.2307 -0.1148 -0.1537 -0.2163 0.1007 0.0893 0.0913 0.1075 0.0853 0.0747 0.0815 0.0962 0.0585 0.1047 0.0932 0.0984 0.0796 0.0868 0.0455 0.0872 0.0882 0.0921 0.1261 0.0871 0.1033 0.1050 0.0913 0.1275 0.1052 0.0787
va: 2.0757 2.1366 2.1674 3.6868 3.7773 3.8599 3.9002 3.9173 3.8787 4.2494 3.7920 3.7698 3.9318 3.9307 3.8791 3.7427 3.3763 4.1306 3.9391 3.8970 3.8243 3.9454 1.0064 1.0275 1.0100 1.0034 1.0032 1.0091 1.0064 1.0029 1.0218 1.0278 0.9982 1.0039 1.0098 1.0006 1.0289 1.0017 1.0316 1.0247 1.0099 1.0088 0.9976 1.0233 1.0053 1.0077 1.0101 1.0174
dispcorr: -0.027543477 hartree
energy: -965.425627466919
dipole: 14.22165 -13.35160 0.87005 -12.28881 11.81415 -0.47466 -4.73968 5.00175 0.26207
magnitude: 1.02517 au
magnitude: 2.60577 debye
