program: Orca
programVersion: 5.0.2
elementType: O O O C C C C C C C C C C C C C C C C C C C H H H H H H H H H H H H H H H H H H H H H H H H H H
charge: 0
multiplicity: 1
keywords: wb97x-d3
keywords: def2-TZVPP
keywords: def2/J RIJCOSX
keywords: DEFGRID2
keywords: scfconv7
keywords: smallprint printgap noloewdin
keywords: NOSOSCF
formula: C19H26O3
InChI: InChI=1/C19H26O3/c1-7-8-13-12(4)16(10-15(13)20)22-18(21)17-14(9-11(2)3)19(17,5)6/h7,9,14,16-17H,1,8,10H2,2-6H3
48 atoms
O  0.257434 0.667062 0.547602
O  0.866844 2.358395 1.866441
O  -3.978289 1.9409 -0.764272
C  2.875423 1.226192 -0.966394
C  3.138552 0.093393 -0.030958
C  2.518339 1.384029 0.49981
C  1.810512 1.119114 -2.030512
C  4.067503 2.036648 -1.422151
C  2.439527 -1.21068 -0.116572
C  1.151299 1.528217 1.043465
C  2.52356 -2.180234 0.796179
C  -1.085569 0.803799 1.012511
C  3.245894 -2.027548 2.100172
C  1.891856 -3.521091 0.571876
C  -1.838188 1.977699 0.3925
C  -1.845529 -0.422871 0.580045
C  -2.972055 -0.110674 -0.07321
C  -3.07239 1.352422 -0.23114
C  -1.337859 -1.773422 0.924584
C  -4.010337 -1.029524 -0.632967
C  -3.667438 -1.442342 -2.033347
C  -3.480053 -2.694262 -2.426971
H  4.177282 0.00192 0.274873
H  3.198887 2.016039 1.05861
H  1.443964 2.111168 -2.300337
H  2.238141 0.675212 -2.931417
H  0.952392 0.520326 -1.741779
H  4.83673 2.10136 -0.6518
H  4.523129 1.585412 -2.305549
H  3.773061 3.054834 -1.681908
H  1.874687 -1.40838 -1.021811
H  -1.07821 0.871072 2.105227
H  4.090839 -2.717863 2.165894
H  2.582619 -2.271322 2.933634
H  3.619573 -1.019394 2.266382
H  1.375061 -3.57806 -0.385843
H  1.172567 -3.76018 1.359641
H  2.644023 -4.313923 0.589928
H  -1.250216 2.470411 -0.384665
H  -2.109522 2.744923 1.11701
H  -2.024178 -2.561411 0.622689
H  -0.37765 -1.952492 0.43985
H  -1.161535 -1.858905 1.999415
H  -4.970171 -0.50525 -0.63581
H  -4.12904 -1.911763 -0.000647
H  -3.569513 -0.634572 -2.751842
H  -3.233924 -2.934915 -3.451997
H  -3.574517 -3.528914 -1.7425
totalener: -965.40013933 hartree
nucrepener: 1875.54487510 hartree
electener: -2840.94501443 hartree
oneelecener: -5036.90022563 hartree
twoeener: 2195.95521120 hartree
kineticenergy: 961.05211333 hartree
xcener: -95.141246148087 hartree
chargesum: -0.0000000
charge: -0.272854 -0.361407 -0.330007 0.135797 -0.042007 -0.112259 -0.293105 -0.241166 -0.177552 0.333352 -0.025174 0.182651 -0.253089 -0.246183 -0.140264 -0.052585 -0.031650 0.238454 -0.240948 -0.115842 -0.140882 -0.220356 0.094636 0.088356 0.096338 0.096000 0.085868 0.071961 0.087085 0.093261 0.098008 0.095833 0.094619 0.085739 0.085635 0.086427 0.085498 0.101315 0.083858 0.100301 0.089056 0.095586 0.099941 0.104236 0.085255 0.122239 0.102987 0.077036
qa: -0.2729 -0.3614 -0.3300 0.1358 -0.0420 -0.1123 -0.2931 -0.2412 -0.1776 0.3334 -0.0252 0.1827 -0.2531 -0.2462 -0.1403 -0.0526 -0.0317 0.2385 -0.2409 -0.1158 -0.1409 -0.2204 0.0946 0.0884 0.0963 0.0960 0.0859 0.0720 0.0871 0.0933 0.0980 0.0958 0.0946 0.0857 0.0856 0.0864 0.0855 0.1013 0.0839 0.1003 0.0891 0.0956 0.0999 0.1042 0.0853 0.1222 0.1030 0.0770
va: 2.0849 2.1465 2.1697 3.7429 3.8023 3.8713 3.9177 3.9075 3.8522 4.2219 3.6917 3.8065 3.9556 3.9424 3.8777 3.7135 3.3990 4.1137 3.9503 3.8943 3.8344 3.9620 1.0049 1.0284 1.0023 1.0023 1.0158 1.0087 1.0040 1.0041 1.0072 1.0189 0.9991 1.0009 1.0083 1.0050 0.9947 1.0013 1.0284 1.0280 1.0153 1.0110 1.0016 1.0227 1.0048 1.0107 1.0103 1.0155
dispcorr: -0.025627499 hartree
energy: -965.425766829188
dipole: 14.23556 -12.97067 1.26488 -15.99695 14.52004 -1.47691 -4.45604 4.50854 0.05250
magnitude: 1.94524 au
magnitude: 4.94440 debye
