program: Orca
programVersion: 5.0.2
elementType: O O O C C C C C C C C C C C C C C C C C C C H H H H H H H H H H H H H H H H H H H H H H H H H H
charge: 0
multiplicity: 1
keywords: wb97x-d3
keywords: def2-TZVPP
keywords: def2/J RIJCOSX
keywords: DEFGRID2
keywords: scfconv7
keywords: smallprint printgap noloewdin
keywords: NOSOSCF
formula: C19H26O3
InChI: InChI=1/C19H26O3/c1-7-8-13-12(4)16(10-15(13)20)22-18(21)17-14(9-11(2)3)19(17,5)6/h7,9,14,16-17H,1,8,10H2,2-6H3
48 atoms
O  -0.013773 0.93067 0.784639
O  1.076364 2.471268 -0.408276
O  -2.712188 -0.98524 -2.079325
C  3.692124 1.086461 0.480424
C  2.972896 -0.163196 0.065834
C  2.282244 0.880213 0.946845
C  4.065447 2.143252 -0.531963
C  4.743233 0.92074 1.555268
C  2.494912 -0.39409 -1.320148
C  1.096883 1.549837 0.360095
C  1.580422 -1.30508 -1.663726
C  -1.254682 1.343169 0.208156
C  0.901411 -2.205646 -0.675579
C  1.172829 -1.505443 -3.092092
C  -1.413777 0.891604 -1.23976
C  -2.318915 0.590643 0.968462
C  -2.967328 -0.286012 0.191513
C  -2.413886 -0.243693 -1.176401
C  -2.507451 0.833676 2.420465
C  -4.026024 -1.267323 0.584759
C  -3.429476 -2.460107 1.271998
C  -3.762293 -2.879413 2.484835
H  3.257707 -1.063273 0.602825
H  2.143215 0.58861 1.983213
H  5.038724 1.901355 -0.963184
H  3.353118 2.25386 -1.34296
H  4.15129 3.116778 -0.048037
H  4.469275 0.153247 2.280954
H  5.700732 0.633725 1.117498
H  4.892154 1.854012 2.101285
H  2.935629 0.211375 -2.105201
H  -1.366504 2.425741 0.321905
H  1.035379 -1.888017 0.355975
H  1.276856 -3.22812 -0.768031
H  -0.171408 -2.254394 -0.872512
H  0.096603 -1.36005 -3.217305
H  1.3848 -2.526428 -3.419559
H  1.690567 -0.823621 -3.765687
H  -0.478338 0.578342 -1.703043
H  -1.817672 1.691979 -1.863168
H  -1.604967 0.560407 2.970394
H  -2.687997 1.893099 2.616241
H  -3.33416 0.259748 2.832875
H  -4.54972 -1.593749 -0.317924
H  -4.769756 -0.79713 1.232235
H  -2.669113 -2.995029 0.711477
H  -3.299418 -3.748943 2.930713
H  -4.51829 -2.376493 3.076285
totalener: -965.40041341 hartree
nucrepener: 1898.36379083 hartree
electener: -2863.76420423 hartree
oneelecener: -5082.97851295 hartree
twoeener: 2219.21430872 hartree
kineticenergy: 961.04773817 hartree
xcener: -95.138940160799 hartree
chargesum: -0.0000000
charge: -0.264326 -0.355637 -0.338773 0.131140 -0.047171 -0.091763 -0.257145 -0.250920 -0.143793 0.287275 -0.095370 0.231395 -0.260168 -0.193658 -0.146663 -0.054510 -0.033358 0.203203 -0.231189 -0.113153 -0.140724 -0.221316 0.088826 0.081653 0.087450 0.087754 0.088786 0.069013 0.090167 0.091174 0.096109 0.091661 0.088849 0.107757 0.081669 0.086555 0.091579 0.080347 0.096473 0.097831 0.108961 0.099278 0.083146 0.104927 0.088618 0.115435 0.102372 0.080234
qa: -0.2643 -0.3556 -0.3388 0.1311 -0.0472 -0.0918 -0.2571 -0.2509 -0.1438 0.2873 -0.0954 0.2314 -0.2602 -0.1937 -0.1467 -0.0545 -0.0334 0.2032 -0.2312 -0.1132 -0.1407 -0.2213 0.0888 0.0817 0.0874 0.0878 0.0888 0.0690 0.0902 0.0912 0.0961 0.0917 0.0888 0.1078 0.0817 0.0866 0.0916 0.0803 0.0965 0.0978 0.1090 0.0993 0.0831 0.1049 0.0886 0.1154 0.1024 0.0802
va: 2.1047 2.1397 2.1392 3.7932 3.8368 3.8229 3.9151 3.9039 3.8178 4.2595 3.7963 3.7654 3.9468 3.9142 3.8906 3.7704 3.4490 4.0531 3.9433 3.8834 3.8338 3.9598 1.0039 1.0277 0.9981 1.0204 1.0064 1.0061 1.0051 1.0049 1.0110 1.0190 1.0103 1.0010 1.0046 1.0142 0.9989 1.0088 1.0356 1.0263 1.0067 1.0028 1.0123 1.0236 1.0038 1.0135 1.0111 1.0150
dispcorr: -0.027016600 hartree
energy: -965.427430007704
dipole: 9.92962 -9.73442 0.19520 -6.28787 6.35254 0.06466 4.45868 -3.11237 1.34631
magnitude: 1.36192 au
magnitude: 3.46172 debye
