program: Orca
programVersion: 5.0.2
elementType: O O O C C C C C C C C C C C C C C C C C C C H H H H H H H H H H H H H H H H H H H H H H H H H H
charge: 0
multiplicity: 1
keywords: wb97x-d3
keywords: def2-TZVPP
keywords: def2/J RIJCOSX
keywords: DEFGRID2
keywords: scfconv7
keywords: smallprint printgap noloewdin
keywords: NOSOSCF
formula: C19H26O3
InChI: InChI=1/C19H26O3/c1-7-8-13-12(4)16(10-15(13)20)22-18(21)17-14(9-11(2)3)19(17,5)6/h7,9,14,16-17H,1,8,10H2,2-6H3
48 atoms
O  0.080027 0.93537 0.687102
O  1.066025 2.220672 -0.850259
O  -2.319032 -1.910218 -1.686789
C  3.767101 1.410961 0.417659
C  3.205502 0.025807 0.293609
C  2.364059 1.160131 0.88423
C  4.07756 2.2325 -0.811199
C  4.774573 1.624732 1.525546
C  2.845331 -0.578759 -1.013116
C  1.143797 1.534881 0.13153
C  2.046381 -1.638329 -1.165872
C  -1.159406 1.03507 -0.0171
C  1.369561 -2.334474 -0.023308
C  1.780724 -2.227916 -2.518193
C  -1.184415 0.203652 -1.295818
C  -2.196482 0.403075 0.877591
C  -2.720186 -0.704768 0.338374
C  -2.110085 -0.953694 -0.982977
C  -2.512369 1.011334 2.194195
C  -3.771095 -1.605445 0.907846
C  -5.142896 -1.027396 0.723376
C  -5.988014 -0.753682 1.707574
H  3.551218 -0.684939 1.038727
H  2.207482 1.100407 1.95661
H  4.042851 3.296529 -0.574057
H  5.089029 2.002047 -1.152003
H  3.395018 2.068548 -1.638677
H  4.794989 2.670071 1.838182
H  4.550837 1.02031 2.406224
H  5.77819 1.357274 1.190559
H  3.289919 -0.141814 -1.9011
H  -1.386729 2.088895 -0.204731
H  1.393954 -1.761898 0.901082
H  1.835381 -3.30524 0.165341
H  0.324044 -2.538874 -0.261293
H  2.281678 -1.675936 -3.312513
H  0.709515 -2.246477 -2.736137
H  2.121198 -3.265462 -2.564559
H  -0.199312 -0.147948 -1.603338
H  -1.58669 0.773306 -2.135769
H  -2.834842 2.047419 2.067834
H  -3.302846 0.47874 2.717457
H  -1.626088 1.033488 2.830751
H  -3.585173 -1.79691 1.967075
H  -3.710734 -2.569215 0.394816
H  -5.435322 -0.824082 -0.302013
H  -6.966508 -0.336258 1.514479
H  -5.739358 -0.944914 2.744891
totalener: -965.40089650 hartree
nucrepener: 1879.04571960 hartree
electener: -2844.44661611 hartree
oneelecener: -5044.32746682 hartree
twoeener: 2199.88085071 hartree
kineticenergy: 961.04478005 hartree
xcener: -95.138966059333 hartree
chargesum: -0.0000000
charge: -0.267775 -0.355776 -0.339029 0.133767 -0.046052 -0.095782 -0.260974 -0.249590 -0.143330 0.288578 -0.093092 0.228733 -0.265912 -0.190675 -0.147999 -0.058210 -0.022720 0.214227 -0.230294 -0.129246 -0.142198 -0.220352 0.089358 0.081294 0.088762 0.087469 0.089865 0.091462 0.069001 0.089778 0.092875 0.092621 0.088029 0.107110 0.091533 0.079467 0.084764 0.091543 0.094020 0.097243 0.096241 0.082317 0.110088 0.091810 0.103953 0.119322 0.103817 0.079955
qa: -0.2678 -0.3558 -0.3390 0.1338 -0.0461 -0.0958 -0.2610 -0.2496 -0.1433 0.2886 -0.0931 0.2287 -0.2659 -0.1907 -0.1480 -0.0582 -0.0227 0.2142 -0.2303 -0.1292 -0.1422 -0.2204 0.0894 0.0813 0.0888 0.0875 0.0899 0.0915 0.0690 0.0898 0.0929 0.0926 0.0880 0.1071 0.0915 0.0795 0.0848 0.0915 0.0940 0.0972 0.0962 0.0823 0.1101 0.0918 0.1040 0.1193 0.1038 0.0800
va: 2.1021 2.1398 2.1416 3.7859 3.8406 3.8264 3.9154 3.9031 3.8226 4.2556 3.7975 3.7574 3.9422 3.9169 3.8828 3.7670 3.4364 4.0381 3.9399 3.8859 3.8340 3.9560 1.0042 1.0287 1.0065 0.9979 1.0198 1.0050 1.0062 1.0050 1.0117 1.0194 1.0106 1.0013 1.0042 1.0094 1.0125 0.9983 1.0386 1.0274 1.0025 1.0147 1.0070 1.0037 1.0272 1.0100 1.0111 1.0147
dispcorr: -0.026417264 hartree
energy: -965.427313767968
dipole: 8.63022 -8.42656 0.20366 -2.41766 2.78865 0.37099 4.83595 -3.53546 1.30049
magnitude: 1.36762 au
magnitude: 3.47622 debye
