program: Orca
programVersion: 5.0.2
elementType: O O O C C C C C C C C C C C C C C C C C C C H H H H H H H H H H H H H H H H H H H H H H H H H H
charge: 0
multiplicity: 1
keywords: wb97x-d3
keywords: def2-TZVPP
keywords: def2/J RIJCOSX
keywords: DEFGRID2
keywords: scfconv7
keywords: smallprint printgap noloewdin
keywords: NOSOSCF
formula: C19H26O3
InChI: InChI=1/C19H26O3/c1-7-8-13-12(4)16(10-15(13)20)22-18(21)17-14(9-11(2)3)19(17,5)6/h7,9,14,16-17H,1,8,10H2,2-6H3
48 atoms
O  0.118277 0.891174 0.7540
O  1.015127 2.347989 -0.681042
O  -2.454198 -1.586874 -1.945623
C  3.777447 1.425133 0.360665
C  3.206373 0.041465 0.249749
C  2.402748 1.167193 0.89997
C  4.01824 2.258028 -0.876043
C  4.848028 1.623874 1.410345
C  2.773654 -0.54141 -1.045478
C  1.145325 1.570639 0.223574
C  1.930251 -1.568977 -1.174341
C  -1.154144 1.034824 0.121238
C  1.27323 -2.249991 -0.012156
C  1.585397 -2.132628 -2.51969
C  -1.220772 0.391803 -1.260932
C  -2.129468 0.251148 0.963448
C  -2.688157 -0.757978 0.283562
C  -2.168683 -0.77806 -1.097795
C  -2.364567 0.633292 2.378499
C  -3.70408 -1.747947 0.75936
C  -5.091639 -1.183594 0.688431
C  -5.903763 -1.045377 1.72722
H  3.59478 -0.680695 0.962552
H  2.304172 1.093569 1.978745
H  4.004242 3.319529 -0.627998
H  5.005826 2.025151 -1.279155
H  3.286843 2.105696 -1.662988
H  4.887654 2.665016 1.735238
H  4.674472 1.007902 2.294229
H  5.830288 1.360665 1.014131
H  3.20117 -0.115323 -1.947269
H  -1.425142 2.095345 0.092619
H  1.63112 -3.279017 0.081326
H  0.192775 -2.314202 -0.162617
H  1.443831 -1.742833 0.934767
H  2.072566 -1.590342 -3.329099
H  0.50632 -2.109172 -2.693864
H  1.885428 -3.181261 -2.59083
H  -0.248571 0.05377 -1.62152
H  -1.607268 1.081181 -2.013028
H  -3.13889 0.030268 2.846763
H  -1.447341 0.535508 2.961499
H  -2.669962 1.679653 2.445319
H  -3.482959 -2.069055 1.779385
H  -3.641414 -2.636373 0.125074
H  -5.423979 -0.868957 -0.295758
H  -6.894931 -0.627027 1.620193
H  -5.611558 -1.348531 2.725578
totalener: -965.40052892 hartree
nucrepener: 1884.47134622 hartree
electener: -2849.87187514 hartree
oneelecener: -5055.12512032 hartree
twoeener: 2205.25324518 hartree
kineticenergy: 961.04578021 hartree
xcener: -95.139205362958 hartree
chargesum: -0.0000000
charge: -0.266118 -0.351134 -0.338000 0.129142 -0.042571 -0.093072 -0.259273 -0.251133 -0.150520 0.287888 -0.094199 0.218257 -0.249324 -0.193624 -0.154972 -0.039374 -0.055345 0.231826 -0.232714 -0.129166 -0.139791 -0.219871 0.088028 0.082209 0.089548 0.087881 0.087169 0.091750 0.068544 0.089846 0.094374 0.095661 0.104366 0.085997 0.084979 0.080402 0.087502 0.091226 0.096229 0.099961 0.083228 0.110349 0.096253 0.090465 0.103649 0.121009 0.103797 0.078668
qa: -0.2661 -0.3511 -0.3380 0.1291 -0.0426 -0.0931 -0.2593 -0.2511 -0.1505 0.2879 -0.0942 0.2183 -0.2493 -0.1936 -0.1550 -0.0394 -0.0553 0.2318 -0.2327 -0.1292 -0.1398 -0.2199 0.0880 0.0822 0.0895 0.0879 0.0872 0.0917 0.0685 0.0898 0.0944 0.0957 0.1044 0.0860 0.0850 0.0804 0.0875 0.0912 0.0962 0.1000 0.0832 0.1103 0.0963 0.0905 0.1036 0.1210 0.1038 0.0787
va: 2.1016 2.1466 2.1469 3.7920 3.8392 3.8259 3.9198 3.9040 3.8251 4.2548 3.8008 3.7683 3.9508 3.9156 3.8786 3.7350 3.4193 4.0399 3.9461 3.8933 3.8341 3.9582 1.0044 1.0269 1.0074 0.9975 1.0184 1.0049 1.0062 1.0049 1.0105 1.0174 1.0029 0.9998 1.0120 1.0090 1.0119 0.9990 1.0357 1.0294 1.0139 1.0065 1.0023 1.0033 1.0256 1.0103 1.0110 1.0149
dispcorr: -0.026788357 hartree
energy: -965.427317276834
dipole: 8.81845 -8.51176 0.30669 -3.55716 3.72700 0.16983 4.97834 -3.56349 1.41485
magnitude: 1.45764 au
magnitude: 3.70502 debye
