program: Orca
programVersion: 5.0.2
elementType: O O O C C C C C C C C C C C C C C C C C C C H H H H H H H H H H H H H H H H H H H H H H H H H H
charge: 0
multiplicity: 1
keywords: wb97x-d3
keywords: def2-TZVPP
keywords: def2/J RIJCOSX
keywords: DEFGRID2
keywords: scfconv7
keywords: smallprint printgap noloewdin
keywords: NOSOSCF
formula: C19H26O3
InChI: InChI=1/C19H26O3/c1-7-8-13-12(4)16(10-15(13)20)22-18(21)17-14(9-11(2)3)19(17,5)6/h7,9,14,16-17H,1,8,10H2,2-6H3
48 atoms
O  0.095969 1.036051 0.678793
O  1.100494 2.119903 -0.994501
O  -2.463437 -1.925283 -1.391162
C  3.788465 1.456987 0.3693
C  3.235368 0.063389 0.384245
C  2.383562 1.245745 0.851108
C  4.096688 2.152064 -0.935667
C  4.788026 1.792339 1.453932
C  2.889275 -0.676896 -0.854919
C  1.168909 1.547606 0.057997
C  2.067557 -1.728286 -0.906955
C  -1.150239 1.106881 -0.016897
C  1.349162 -2.277751 0.289029
C  1.819136 -2.462908 -2.189347
C  -1.226248 0.158107 -1.209531
C  -2.192906 0.603084 0.950185
C  -2.777074 -0.522117 0.520388
C  -2.202771 -0.918595 -0.782911
C  -2.448739 1.347134 2.210602
C  -3.864713 -1.324478 1.15744
C  -5.210789 -0.879708 0.660754
C  -5.986065 -1.588723 -0.146855
H  3.580397 -0.56421 1.201272
H  2.220706 1.294295 1.923109
H  4.035665 3.233951 -0.813283
H  5.116796 1.910182 -1.240614
H  3.428116 1.885471 -1.747485
H  4.798719 2.86489 1.655591
H  4.56272 1.28156 2.391581
H  5.795707 1.499627 1.154342
H  3.366496 -0.353426 -1.774084
H  -1.344895 2.145084 -0.303449
H  0.300489 -2.472667 0.054683
H  1.379529 -1.613214 1.149601
H  1.779165 -3.23816 0.585838
H  2.355664 -2.020075 -3.027454
H  0.753869 -2.477219 -2.434787
H  2.129775 -3.507508 -2.106127
H  -0.261189 -0.267996 -1.485761
H  -1.608358 0.662723 -2.098741
H  -3.213282 0.875368 2.824739
H  -1.536607 1.428332 2.803951
H  -2.773603 2.367428 1.993799
H  -3.81888 -1.231431 2.245589
H  -3.714502 -2.37913 0.919762
H  -5.533959 0.105591 0.983995
H  -6.941391 -1.21326 -0.487268
H  -5.687929 -2.564911 -0.507514
totalener: -965.40042858 hartree
nucrepener: 1876.32080577 hartree
electener: -2841.72123436 hartree
oneelecener: -5038.98312903 hartree
twoeener: 2197.26189468 hartree
kineticenergy: 961.04505488 hartree
xcener: -95.137875194806 hartree
chargesum: -0.0000000
charge: -0.267744 -0.356743 -0.335563 0.134944 -0.052997 -0.093663 -0.261215 -0.249633 -0.144179 0.289423 -0.090083 0.231937 -0.259908 -0.189051 -0.154550 -0.046976 -0.020293 0.215696 -0.247989 -0.137036 -0.148658 -0.194337 0.090405 0.081455 0.089210 0.086751 0.090318 0.091445 0.069168 0.089266 0.092244 0.091997 0.088896 0.087557 0.106213 0.078629 0.084595 0.091068 0.093595 0.097760 0.086710 0.109191 0.097880 0.097570 0.092816 0.103576 0.099742 0.090563
qa: -0.2677 -0.3567 -0.3356 0.1349 -0.0530 -0.0937 -0.2612 -0.2496 -0.1442 0.2894 -0.0901 0.2319 -0.2599 -0.1891 -0.1545 -0.0470 -0.0203 0.2157 -0.2480 -0.1370 -0.1487 -0.1943 0.0904 0.0815 0.0892 0.0868 0.0903 0.0914 0.0692 0.0893 0.0922 0.0920 0.0889 0.0876 0.1062 0.0786 0.0846 0.0911 0.0936 0.0978 0.0867 0.1092 0.0979 0.0976 0.0928 0.1036 0.0997 0.0906
va: 2.1026 2.1391 2.1462 3.7825 3.8557 3.8200 3.9161 3.9038 3.8264 4.2508 3.7890 3.7580 3.9435 3.9206 3.8934 3.7322 3.4526 4.0517 3.9444 3.8861 3.8404 3.9824 1.0047 1.0284 1.0065 0.9980 1.0196 1.0046 1.0063 1.0051 1.0119 1.0193 1.0037 1.0110 1.0017 1.0100 1.0101 0.9979 1.0357 1.0277 1.0077 1.0069 0.9993 1.0043 1.0280 1.0086 1.0074 1.0191
dispcorr: -0.026130323 hartree
energy: -965.426558906009
dipole: 8.96362 -8.73388 0.22974 -2.70557 3.21999 0.51442 3.68239 -2.38023 1.30216
magnitude: 1.41881 au
magnitude: 3.60634 debye
