program: Orca
programVersion: 5.0.2
elementType: O O O C C C C C C C C C C C C C C C C C C C H H H H H H H H H H H H H H H H H H H H H H H H H H
charge: 0
multiplicity: 1
keywords: wb97x-d3
keywords: def2-TZVPP
keywords: def2/J RIJCOSX
keywords: DEFGRID2
keywords: scfconv7
keywords: smallprint printgap noloewdin
keywords: NOSOSCF
formula: C19H26O3
InChI: InChI=1/C19H26O3/c1-7-8-13-12(4)16(10-15(13)20)22-18(21)17-14(9-11(2)3)19(17,5)6/h7,9,14,16-17H,1,8,10H2,2-6H3
48 atoms
O  0.016597 1.093961 0.823521
O  1.139062 2.501947 -0.495487
O  -2.771313 -0.957444 -1.90055
C  3.718976 1.103118 0.467448
C  2.950639 -0.1583 0.203462
C  2.313869 0.997241 0.978719
C  4.103127 2.031414 -0.660582
C  4.789371 1.016428 1.532258
C  2.439327 -0.524486 -1.140776
C  1.140535 1.645544 0.34475
C  1.485728 -1.432963 -1.365148
C  -1.214394 1.47993 0.205708
C  0.790055 -2.185509 -0.270915
C  1.050928 -1.783853 -2.756359
C  -1.377666 0.906932 -1.19791
C  -2.296537 0.820256 1.024637
C  -2.957387 -0.111381 0.326589
C  -2.421607 -0.180249 -1.048505
C  -2.483102 1.20415 2.447407
C  -4.008981 -1.068227 0.784864
C  -3.358914 -2.328473 1.282846
C  -3.349667 -3.480572 0.62813
H  3.218716 -1.003537 0.830723
H  2.187803 0.822319 2.042698
H  4.23187 3.048101 -0.287516
H  5.057588 1.709805 -1.082442
H  3.376121 2.077664 -1.464761
H  4.976366 1.995301 1.978137
H  4.512135 0.33377 2.337746
H  5.728478 0.658922 1.105891
H  2.889565 -0.031074 -1.995824
H  -1.303215 2.570532 0.22257
H  0.97476 -1.769367 0.71689
H  1.109306 -3.231411 -0.263886
H  -0.290441 -2.198636 -0.429064
H  1.576974 -1.198727 -3.510182
H  -0.022909 -1.625168 -2.886581
H  1.232734 -2.841074 -2.966006
H  -0.451108 0.510911 -1.614108
H  -1.737073 1.662501 -1.899229
H  -2.600601 2.285675 2.544519
H  -3.352454 0.726948 2.896304
H  -1.605793 0.930619 3.036542
H  -4.677904 -1.29803 -0.046038
H  -4.616474 -0.621597 1.575923
H  -2.835387 -2.247445 2.230665
H  -2.842648 -4.35021 1.023439
H  -3.836708 -3.591523 -0.332074
totalener: -965.39993970 hartree
nucrepener: 1909.38681283 hartree
electener: -2874.78675253 hartree
oneelecener: -5105.18362459 hartree
twoeener: 2230.39687206 hartree
kineticenergy: 961.04666799 hartree
xcener: -95.138952366376 hartree
chargesum: -0.0000000
charge: -0.266174 -0.354310 -0.336626 0.129972 -0.044744 -0.091906 -0.256278 -0.251050 -0.146194 0.287962 -0.094415 0.233807 -0.246905 -0.196872 -0.147588 -0.047310 -0.023015 0.199390 -0.252234 -0.125680 -0.148201 -0.202382 0.088213 0.080631 0.089174 0.086996 0.086952 0.091290 0.068326 0.089659 0.095189 0.092223 0.083779 0.104214 0.080784 0.080540 0.089035 0.091129 0.095302 0.098224 0.098548 0.088768 0.109468 0.093595 0.098062 0.104969 0.102253 0.093431
qa: -0.2662 -0.3543 -0.3366 0.1300 -0.0447 -0.0919 -0.2563 -0.2511 -0.1462 0.2880 -0.0944 0.2338 -0.2469 -0.1969 -0.1476 -0.0473 -0.0230 0.1994 -0.2522 -0.1257 -0.1482 -0.2024 0.0882 0.0806 0.0892 0.0870 0.0870 0.0913 0.0683 0.0897 0.0952 0.0922 0.0838 0.1042 0.0808 0.0805 0.0890 0.0911 0.0953 0.0982 0.0985 0.0888 0.1095 0.0936 0.0981 0.1050 0.1023 0.0934
va: 2.1024 2.1418 2.1412 3.7954 3.8362 3.8260 3.9165 3.9036 3.8128 4.2592 3.8017 3.7684 3.9510 3.9119 3.8900 3.7361 3.4493 4.0509 3.9468 3.8831 3.8348 3.9719 1.0039 1.0275 1.0065 0.9981 1.0198 1.0048 1.0063 1.0051 1.0110 1.0192 1.0119 1.0022 1.0012 1.0086 1.0142 0.9992 1.0367 1.0269 1.0025 1.0072 1.0034 1.0279 1.0041 1.0079 1.0071 1.0208
dispcorr: -0.027510451 hartree
energy: -965.427450147133
dipole: 10.12727 -9.95709 0.17019 -7.10175 7.21373 0.11197 3.50069 -2.11809 1.38260
magnitude: 1.39753 au
magnitude: 3.55223 debye
