program: Orca
programVersion: 5.0.2
elementType: O O O C C C C C C C C C C C C C C C C C C C H H H H H H H H H H H H H H H H H H H H H H H H H H
charge: 0
multiplicity: 1
keywords: wb97x-d3
keywords: def2-TZVPP
keywords: def2/J RIJCOSX
keywords: DEFGRID2
keywords: scfconv7
keywords: smallprint printgap noloewdin
keywords: NOSOSCF
formula: C19H26O3
InChI: InChI=1/C19H26O3/c1-7-8-13-12(4)16(10-15(13)20)22-18(21)17-14(9-11(2)3)19(17,5)6/h7,9,14,16-17H,1,8,10H2,2-6H3
48 atoms
O  -0.076788 1.632358 1.256351
O  0.110897 0.616528 -0.723035
O  -4.140282 1.754218 -1.195601
C  3.151447 1.187766 -0.505147
C  2.971474 -0.063636 0.296101
C  2.071667 1.153202 0.553911
C  2.827903 1.223578 -1.978958
C  4.348135 2.043435 -0.155866
C  2.443775 -1.317812 -0.268623
C  0.62735 1.092666 0.254948
C  2.809895 -2.557398 0.071758
C  -1.502112 1.583865 1.205637
C  3.842593 -2.913139 1.098031
C  2.175632 -3.741673 -0.596433
C  -2.179763 2.379437 0.091935
C  -2.07797 0.192433 1.097253
C  -3.115345 0.148518 0.251952
C  -3.279261 1.456889 -0.408146
C  -1.539293 -0.920047 1.920023
C  -4.012848 -1.005308 -0.042589
C  -3.432987 -2.054689 -0.947476
C  -2.221503 -2.051672 -1.485176
H  3.700535 -0.195886 1.087638
H  2.295643 1.694537 1.46555
H  2.631426 2.248776 -2.297264
H  3.688329 0.862486 -2.544686
H  1.968082 0.625596 -2.260794
H  4.584869 2.005152 0.908428
H  5.230754 1.707467 -0.702879
H  4.171191 3.087929 -0.418773
H  1.68409 -1.223874 -1.034011
H  -1.780827 1.99185 2.181485
H  4.299066 -2.054309 1.584595
H  4.646619 -3.496968 0.642953
H  3.408703 -3.542923 1.878546
H  1.415379 -3.446262 -1.318592
H  1.701316 -4.399095 0.13675
H  2.920542 -4.346428 -1.120069
H  -1.505136 2.610271 -0.732304
H  -2.601686 3.323429 0.43889
H  -0.586152 -1.272389 1.518032
H  -1.354939 -0.60432 2.948345
H  -2.213806 -1.773863 1.932472
H  -4.934061 -0.625788 -0.494756
H  -4.323531 -1.484696 0.892592
H  -4.103318 -2.880885 -1.164459
H  -1.90517 -2.858713 -2.132219
H  -1.511814 -1.252674 -1.316937
totalener: -965.40115137 hartree
nucrepener: 1879.41107560 hartree
electener: -2844.81222697 hartree
oneelecener: -5045.20377815 hartree
twoeener: 2200.39155119 hartree
kineticenergy: 961.03815918 hartree
xcener: -95.144006825110 hartree
chargesum: -0.0000000
charge: -0.278657 -0.415412 -0.329417 0.092930 0.055291 -0.091801 -0.254552 -0.240567 -0.255171 0.337983 -0.047681 0.284219 -0.241497 -0.199346 -0.156973 -0.065708 -0.096952 0.236997 -0.235576 -0.103017 -0.164386 -0.205092 0.086367 0.080779 0.085255 0.088089 0.102998 0.070473 0.091201 0.089459 0.106625 0.099460 0.076851 0.088809 0.086826 0.078615 0.081959 0.086159 0.101273 0.088620 0.104753 0.103446 0.095900 0.095159 0.084147 0.100759 0.091859 0.108544
qa: -0.2787 -0.4154 -0.3294 0.0929 0.0553 -0.0918 -0.2546 -0.2406 -0.2552 0.3380 -0.0477 0.2842 -0.2415 -0.1993 -0.1570 -0.0657 -0.0970 0.2370 -0.2356 -0.1030 -0.1644 -0.2051 0.0864 0.0808 0.0853 0.0881 0.1030 0.0705 0.0912 0.0895 0.1066 0.0995 0.0769 0.0888 0.0868 0.0786 0.0820 0.0862 0.1013 0.0886 0.1048 0.1034 0.0959 0.0952 0.0841 0.1008 0.0919 0.1085
va: 2.1361 2.0563 2.1764 3.7463 3.7556 3.8733 3.9159 3.9048 3.9150 4.1505 3.8011 3.7643 3.9461 3.9359 3.8435 3.6743 3.4557 4.1136 3.9534 3.8651 3.8944 3.9210 1.0073 1.0322 1.0026 1.0016 1.0215 1.0083 1.0039 1.0053 1.0176 0.9908 1.0169 0.9989 0.9995 1.0130 0.9988 0.9990 1.0325 1.0268 1.0010 1.0037 1.0041 1.0237 0.9981 1.0071 1.0129 1.0219
dispcorr: -0.025167658 hartree
energy: -965.426319027729
dipole: 19.89600 -18.46533 1.43068 -14.18429 13.75170 -0.43259 0.47390 0.96654 1.44044
magnitude: 2.07578 au
magnitude: 5.27620 debye
