program: Orca
programVersion: 5.0.2
elementType: O O O C C C C C C C C C C C C C C C C C C C H H H H H H H H H H H H H H H H H H H H H H H H H H
charge: 0
multiplicity: 1
keywords: wb97x-d3
keywords: def2-TZVPP
keywords: def2/J RIJCOSX
keywords: DEFGRID2
keywords: scfconv7
keywords: smallprint printgap noloewdin
keywords: NOSOSCF
formula: C19H26O3
InChI: InChI=1/C19H26O3/c1-7-8-13-12(4)16(10-15(13)20)22-18(21)17-14(9-11(2)3)19(17,5)6/h7,9,14,16-17H,1,8,10H2,2-6H3
48 atoms
O  0.324716 1.253382 0.297621
O  0.858877 1.73295 2.417139
O  -3.862472 1.222847 -1.668364
C  3.286502 1.462069 -0.364841
C  3.005562 0.032614 -0.038081
C  2.593783 1.135744 0.942337
C  2.580287 2.167053 -1.497751
C  4.717844 1.927359 -0.210567
C  2.025012 -0.790532 -0.783254
C  1.189162 1.41481 1.304792
C  1.648162 -2.025654 -0.448873
C  -1.069224 1.415234 0.553673
C  2.127598 -2.739529 0.779067
C  0.688549 -2.801055 -1.298965
C  -1.772797 1.972345 -0.676904
C  -1.734158 0.083344 0.808461
C  -2.819386 -0.085255 0.039844
C  -2.963749 1.053458 -0.884042
C  -1.205239 -0.846868 1.836175
C  -3.78088 -1.231868 0.035964
C  -3.244817 -2.409943 -0.72051
C  -3.102044 -3.628926 -0.217914
H  3.866036 -0.525073 0.319953
H  3.222795 1.224471 1.820434
H  2.529748 3.239495 -1.303319
H  3.146953 2.028916 -2.420276
H  1.568293 1.819798 -1.677078
H  4.761196 2.999399 -0.010671
H  5.227779 1.418378 0.608342
H  5.285238 1.734757 -1.122749
H  1.610619 -0.364852 -1.690004
H  -1.20455 2.063805 1.423159
H  2.693202 -2.101938 1.455345
H  2.756767 -3.593028 0.514162
H  1.283753 -3.147082 1.340838
H  1.125923 -3.749709 -1.620397
H  0.393661 -2.2489 -2.190627
H  -0.220655 -3.044898 -0.743499
H  -1.126357 1.922317 -1.555776
H  -2.091223 3.00922 -0.568845
H  -1.062054 -0.338017 2.790295
H  -1.858343 -1.70384 1.985061
H  -0.227383 -1.225025 1.529639
H  -4.711072 -0.896694 -0.431644
H  -4.028719 -1.528564 1.057644
H  -2.962893 -2.221136 -1.751741
H  -2.716551 -4.445783 -0.812727
H  -3.374555 -3.86021 0.805094
totalener: -965.39987433 hartree
nucrepener: 1906.52900800 hartree
electener: -2871.92888233 hartree
oneelecener: -5098.86366690 hartree
twoeener: 2226.93478458 hartree
kineticenergy: 961.05391086 hartree
xcener: -95.144455478077 hartree
chargesum: -0.0000000
charge: -0.265489 -0.367060 -0.330499 0.130949 -0.051430 -0.108573 -0.263480 -0.244900 -0.149134 0.332089 -0.070374 0.187088 -0.254287 -0.192504 -0.142006 -0.064357 -0.038080 0.227984 -0.229488 -0.104380 -0.157836 -0.225120 0.092566 0.086590 0.096323 0.094196 0.069764 0.093297 0.072643 0.088597 0.084772 0.106466 0.090003 0.105253 0.082293 0.095595 0.078524 0.062709 0.085154 0.088718 0.129673 0.088503 0.081184 0.104761 0.091558 0.122574 0.109305 0.079869
qa: -0.2655 -0.3671 -0.3305 0.1309 -0.0514 -0.1086 -0.2635 -0.2449 -0.1491 0.3321 -0.0704 0.1871 -0.2543 -0.1925 -0.1420 -0.0644 -0.0381 0.2280 -0.2295 -0.1044 -0.1578 -0.2251 0.0926 0.0866 0.0963 0.0942 0.0698 0.0933 0.0726 0.0886 0.0848 0.1065 0.0900 0.1053 0.0823 0.0956 0.0785 0.0627 0.0852 0.0887 0.1297 0.0885 0.0812 0.1048 0.0916 0.1226 0.1093 0.0799
va: 2.0816 2.1361 2.1719 3.7643 3.8047 3.8596 3.9142 3.9072 3.8541 4.2300 3.7598 3.7693 3.9284 3.9330 3.8862 3.7138 3.3498 4.1279 3.9399 3.8731 3.8271 3.9326 1.0046 1.0282 1.0032 1.0015 1.0186 1.0039 1.0082 1.0042 1.0127 1.0303 1.0061 0.9985 0.9989 1.0023 1.0126 1.0060 1.0287 1.0290 1.0120 1.0117 1.0041 1.0262 1.0045 1.0067 1.0089 1.0174
dispcorr: -0.027520001 hartree
energy: -965.427394331626
dipole: 13.21525 -12.02449 1.19076 -13.19359 12.52835 -0.66524 -2.44781 2.59008 0.14227
magnitude: 1.37138 au
magnitude: 3.48578 debye
