program: Orca
programVersion: 5.0.2
elementType: O O O C C C C C C C C C C C C C C C C C C C H H H H H H H H H H H H H H H H H H H H H H H H H H
charge: 0
multiplicity: 1
keywords: wb97x-d3
keywords: def2-TZVPP
keywords: def2/J RIJCOSX
keywords: DEFGRID2
keywords: scfconv7
keywords: smallprint printgap noloewdin
keywords: NOSOSCF
formula: C19H26O3
InChI: InChI=1/C19H26O3/c1-7-8-13-12(4)16(10-15(13)20)22-18(21)17-14(9-11(2)3)19(17,5)6/h7,9,14,16-17H,1,8,10H2,2-6H3
48 atoms
O  0.089148 1.589781 1.370644
O  0.164821 0.904298 -0.756452
O  -3.930473 1.649726 -1.029383
C  3.216645 1.325678 -0.64219
C  3.010224 0.034634 0.081426
C  2.193483 1.279867 0.466898
C  2.822765 1.492787 -2.089856
C  4.477197 2.087986 -0.298422
C  2.36129 -1.144852 -0.529018
C  0.734148 1.23974 0.247749
C  2.17093 -2.321995 0.072848
C  -1.328169 1.425273 1.418837
C  2.564241 -2.627681 1.487027
C  1.508402 -3.45714 -0.648359
C  -2.148194 2.309605 0.481788
C  -1.7737 0.014203 1.118174
C  -2.78501 -0.017349 0.243559
C  -3.084306 1.346643 -0.227723
C  -1.105306 -1.142209 1.766962
C  -3.483185 -1.220432 -0.30671
C  -2.592497 -1.98691 -1.238981
C  -2.315548 -3.279371 -1.131349
H  3.77305 -0.199213 0.816744
H  2.483183 1.747294 1.401016
H  2.67014 2.549439 -2.31511
H  3.630899 1.134184 -2.729911
H  1.912502 0.971416 -2.365482
H  4.761489 1.962874 0.7473
H  5.312229 1.743161 -0.910575
H  4.348721 3.156028 -0.481725
H  2.01327 -1.042595 -1.549668
H  -1.555885 1.654957 2.463294
H  2.980392 -1.774975 2.019212
H  3.299042 -3.435613 1.51785
H  1.699419 -2.976615 2.057045
H  1.256578 -3.19777 -1.675748
H  0.582728 -3.7500 -0.145535
H  2.150612 -4.341731 -0.668852
H  -1.540152 2.840699 -0.249856
H  -2.727329 3.061521 1.020637
H  -0.850959 -0.929916 2.806473
H  -1.722922 -2.037443 1.733524
H  -0.173578 -1.376696 1.24427
H  -4.373532 -0.885485 -0.846149
H  -3.828823 -1.872723 0.499908
H  -2.153244 -1.411554 -2.047564
H  -1.670181 -3.780684 -1.839734
H  -2.729352 -3.88922 -0.336592
totalener: -965.39837229 hartree
nucrepener: 1914.03489138 hartree
electener: -2879.43326366 hartree
oneelecener: -5114.46029051 hartree
twoeener: 2235.02702685 hartree
kineticenergy: 961.05171513 hartree
xcener: -95.144154854917 hartree
chargesum: -0.0000000
charge: -0.275330 -0.391808 -0.333410 0.128910 -0.055793 -0.066215 -0.271672 -0.240243 -0.151785 0.313371 -0.066270 0.251717 -0.247293 -0.210771 -0.144495 -0.030491 -0.078893 0.217053 -0.241177 -0.116545 -0.107114 -0.260268 0.085096 0.079026 0.085730 0.091038 0.103442 0.070877 0.090906 0.090713 0.095760 0.095703 0.083982 0.101913 0.079740 0.081802 0.075710 0.096609 0.098626 0.091591 0.105325 0.094907 0.081455 0.102736 0.086611 0.120290 0.105527 0.083410
qa: -0.2753 -0.3918 -0.3334 0.1289 -0.0558 -0.0662 -0.2717 -0.2402 -0.1518 0.3134 -0.0663 0.2517 -0.2473 -0.2108 -0.1445 -0.0305 -0.0789 0.2171 -0.2412 -0.1165 -0.1071 -0.2603 0.0851 0.0790 0.0857 0.0910 0.1034 0.0709 0.0909 0.0907 0.0958 0.0957 0.0840 0.1019 0.0797 0.0818 0.0757 0.0966 0.0986 0.0916 0.1053 0.0949 0.0815 0.1027 0.0866 0.1203 0.1055 0.0834
va: 2.1286 2.0911 2.1703 3.7813 3.8350 3.8525 3.9073 3.8972 3.8814 4.1800 3.7883 3.8223 3.9367 3.9396 3.8240 3.6735 3.4484 4.1455 3.9531 3.9079 3.7994 3.9467 1.0073 1.0328 1.0032 0.9992 1.0251 1.0070 1.0045 1.0054 1.0172 0.9910 1.0093 0.9997 0.9993 1.0110 0.9950 0.9999 1.0326 1.0226 1.0085 1.0065 1.0148 1.0271 1.0066 1.0111 1.0079 1.0146
dispcorr: -0.027133742 hartree
energy: -965.425506027127
dipole: 17.13356 -15.71612 1.41744 -14.56770 14.06835 -0.49935 0.40715 0.94681 1.35396
magnitude: 2.02279 au
magnitude: 5.14153 debye
