program: Orca
programVersion: 5.0.2
elementType: O O O C C C C C C C C C C C C C C C C C C C H H H H H H H H H H H H H H H H H H H H H H H H H H
charge: 0
multiplicity: 1
keywords: wb97x-d3
keywords: def2-TZVPP
keywords: def2/J RIJCOSX
keywords: DEFGRID2
keywords: scfconv7
keywords: smallprint printgap noloewdin
keywords: NOSOSCF
formula: C19H26O3
InChI: InChI=1/C19H26O3/c1-7-8-13-12(4)16(10-15(13)20)22-18(21)17-14(9-11(2)3)19(17,5)6/h7,9,14,16-17H,1,8,10H2,2-6H3
48 atoms
O  -0.164463 0.357015 0.344298
O  1.073744 -1.382962 -0.341251
O  -4.521818 0.544432 1.776988
C  3.178786 0.751995 -1.145622
C  3.474435 0.411664 0.273523
C  2.049639 0.79641 -0.134524
C  3.230632 -0.303835 -2.221668
C  3.63873 2.106169 -1.63594
C  3.817979 -0.960071 0.717827
C  0.976379 -0.21452 -0.075742
C  3.720048 -1.399195 1.972394
C  -1.325116 -0.456743 0.514821
C  3.186954 -0.568433 3.099596
C  4.117658 -2.79532 2.341113
C  -2.143627 0.044228 1.698675
C  -2.246319 -0.330871 -0.675465
C  -3.485501 0.027157 -0.313315
C  -3.540954 0.250163 1.142364
C  -1.751284 -0.616974 -2.045438
C  -4.683215 0.242803 -1.183015
C  -4.71936 1.646335 -1.710734
C  -4.688206 1.97155 -2.995473
H  3.963078 1.200594 0.839464
H  1.729886 1.788741 0.16172
H  2.607097 -0.011201 -3.068492
H  4.254618 -0.398636 -2.58877
H  2.897304 -1.282921 -1.89144
H  3.010849 2.460703 -2.4552
H  3.610789 2.859144 -0.847206
H  4.665406 2.051753 -2.002459
H  4.189464 -1.644393 -0.036923
H  -1.021738 -1.499493 0.64028
H  2.92246 0.443625 2.799492
H  3.912104 -0.499696 3.914089
H  2.291137 -1.030488 3.522439
H  3.269703 -3.344806 2.757228
H  4.897077 -2.795446 3.107185
H  4.488422 -3.354705 1.48345
H  -1.757896 0.99505 2.071582
H  -2.160219 -0.648978 2.540141
H  -1.040194 0.149243 -2.362093
H  -1.222299 -1.570085 -2.079231
H  -2.556825 -0.633846 -2.776396
H  -5.581631 0.055736 -0.588404
H  -4.693752 -0.468229 -2.011705
H  -4.766869 2.429977 -0.961074
H  -4.712551 3.002865 -3.319686
H  -4.642972 1.220234 -3.774949
totalener: -965.40254617 hartree
nucrepener: 1817.61411388 hartree
electener: -2783.01666005 hartree
oneelecener: -4921.40216269 hartree
twoeener: 2138.38550265 hartree
kineticenergy: 961.04632491 hartree
xcener: -95.138921957031 hartree
chargesum: -0.0000000
charge: -0.281411 -0.384850 -0.331357 0.134063 -0.067945 -0.094695 -0.283637 -0.239047 -0.156621 0.332058 -0.017034 0.225430 -0.252637 -0.209811 -0.137024 -0.077957 -0.038335 0.221852 -0.234467 -0.118010 -0.140898 -0.218123 0.094382 0.082083 0.082634 0.092658 0.104117 0.090516 0.071772 0.089012 0.083576 0.097269 0.080602 0.094583 0.088469 0.085313 0.083514 0.078527 0.087865 0.086405 0.100592 0.119721 0.084608 0.103664 0.087472 0.121299 0.102807 0.076997
qa: -0.2814 -0.3848 -0.3314 0.1341 -0.0679 -0.0947 -0.2836 -0.2390 -0.1566 0.3321 -0.0170 0.2254 -0.2526 -0.2098 -0.1370 -0.0780 -0.0383 0.2219 -0.2345 -0.1180 -0.1409 -0.2181 0.0944 0.0821 0.0826 0.0927 0.1041 0.0905 0.0718 0.0890 0.0836 0.0973 0.0806 0.0946 0.0885 0.0853 0.0835 0.0785 0.0879 0.0864 0.1006 0.1197 0.0846 0.1037 0.0875 0.1213 0.1028 0.0770
va: 2.1117 2.0947 2.1678 3.7506 3.8908 3.8421 3.9108 3.8995 3.8832 4.1541 3.7703 3.7726 3.9479 3.9430 3.8601 3.7821 3.3928 4.1328 3.9431 3.8963 3.8361 3.9617 1.0042 1.0321 1.0054 0.9987 1.0193 1.0050 1.0076 1.0046 1.0121 1.0284 1.0088 1.0013 0.9993 0.9993 0.9981 1.0114 1.0338 1.0280 1.0026 1.0084 1.0115 1.0237 1.0033 1.0103 1.0104 1.0155
dispcorr: -0.023185129 hartree
energy: -965.425731296903
dipole: 17.78624 -16.59978 1.18646 -0.41938 0.54181 0.12243 -5.90276 5.31171 -0.59105
magnitude: 1.33117 au
magnitude: 3.38357 debye
