program: Orca
programVersion: 5.0.2
elementType: O O O C C C C C C C C C C C C C C C C C C C H H H H H H H H H H H H H H H H H H H H H H H H H H
charge: 0
multiplicity: 1
keywords: wb97x-d3
keywords: def2-TZVPP
keywords: def2/J RIJCOSX
keywords: DEFGRID2
keywords: scfconv7
keywords: smallprint printgap noloewdin
keywords: NOSOSCF
formula: C19H26O3
InChI: InChI=1/C19H26O3/c1-7-8-13-12(4)16(10-15(13)20)22-18(21)17-14(9-11(2)3)19(17,5)6/h7,9,14,16-17H,1,8,10H2,2-6H3
48 atoms
O  0.362772 1.209835 0.23312
O  0.733139 1.663221 2.394424
O  -3.495453 0.777896 -2.184257
C  3.341623 1.523171 -0.242398
C  3.086762 0.08328 0.061429
C  2.584273 1.170413 1.020631
C  2.684886 2.214671 -1.412912
C  4.74848 2.02587 -0.004458
C  2.172407 -0.76269 -0.738226
C  1.148487 1.386035 1.299881
C  1.852462 -2.028292 -0.462307
C  -1.055436 1.229081 0.397099
C  2.347167 -2.77619 0.739206
C  0.937294 -2.804364 -1.36019
C  -1.719219 1.775307 -0.860322
C  -1.581507 -0.180871 0.532808
C  -2.507171 -0.463653 -0.393665
C  -2.703097 0.697309 -1.281574
C  -1.0915 -1.071815 1.614585
C  -3.282919 -1.724778 -0.564804
C  -4.461438 -1.876413 0.354039
C  -4.833239 -1.039615 1.31189
H  3.941781 -0.449834 0.466172
H  3.156677 1.272508 1.935231
H  1.690484 1.849382 -1.646163
H  2.604172 3.285855 -1.221261
H  3.303157 2.087373 -2.303349
H  5.224561 1.526887 0.840642
H  5.371368 1.851823 -0.883536
H  4.751605 3.097688 0.20061
H  1.751165 -0.323253 -1.634831
H  -1.311073 1.814812 1.283563
H  2.876122 -2.146135 1.451694
H  3.017792 -3.587831 0.444731
H  1.515829 -3.24519 1.271526
H  0.626301 -2.225026 -2.228631
H  0.033941 -3.111887 -0.825262
H  1.413392 -3.720657 -1.718518
H  -0.99311 1.934634 -1.659797
H  -2.231365 2.724488 -0.700794
H  -0.041531 -1.324292 1.452128
H  -1.14691 -0.574131 2.583842
H  -1.663586 -1.99563 1.670527
H  -2.62586 -2.592152 -0.438601
H  -3.64269 -1.779683 -1.59641
H  -5.051714 -2.77179 0.185618
H  -5.706861 -1.239409 1.916583
H  -4.293876 -0.126307 1.526597
totalener: -965.39876492 hartree
nucrepener: 1905.96034737 hartree
electener: -2871.35911229 hartree
oneelecener: -5097.71047379 hartree
twoeener: 2226.35136150 hartree
kineticenergy: 961.04745437 hartree
xcener: -95.144065630042 hartree
chargesum: -0.0000000
charge: -0.267362 -0.364088 -0.324801 0.126249 -0.044763 -0.099344 -0.260595 -0.244307 -0.154963 0.323272 -0.066814 0.207280 -0.253963 -0.213928 -0.150799 -0.064814 -0.083226 0.247062 -0.249681 -0.081191 -0.158483 -0.201307 0.090625 0.086002 0.070123 0.095762 0.094187 0.072481 0.088948 0.093416 0.085425 0.108093 0.091062 0.106201 0.080001 0.085970 0.068133 0.099705 0.086336 0.089151 0.097058 0.126911 0.101519 0.078509 0.096845 0.101490 0.102372 0.084239
qa: -0.2674 -0.3641 -0.3248 0.1262 -0.0448 -0.0993 -0.2606 -0.2443 -0.1550 0.3233 -0.0668 0.2073 -0.2540 -0.2139 -0.1508 -0.0648 -0.0832 0.2471 -0.2497 -0.0812 -0.1585 -0.2013 0.0906 0.0860 0.0701 0.0958 0.0942 0.0725 0.0889 0.0934 0.0854 0.1081 0.0911 0.1062 0.0800 0.0860 0.0681 0.0997 0.0863 0.0892 0.0971 0.1269 0.1015 0.0785 0.0968 0.1015 0.1024 0.0842
va: 2.0766 2.1408 2.1811 3.7724 3.7933 3.8531 3.9116 3.9062 3.8583 4.2401 3.7455 3.7560 3.9277 3.9383 3.8959 3.6453 3.3832 4.1024 3.9417 3.8622 3.8883 3.9396 1.0055 1.0283 1.0198 1.0033 1.0014 1.0080 1.0042 1.0040 1.0135 1.0317 1.0059 0.9984 0.9995 1.0098 0.9984 1.0010 1.0286 1.0280 0.9956 1.0113 1.0011 0.9996 1.0230 1.0094 1.0106 1.0200
dispcorr: -0.027506367 hartree
energy: -965.426271287781
dipole: 12.21630 -10.99048 1.22582 -10.48798 9.78311 -0.70487 -0.25797 0.44068 0.18272
magnitude: 1.42578 au
magnitude: 3.62405 debye
