program: Orca
programVersion: 5.0.2
elementType: O O O C C C C C C C C C C C C C C C C C C C H H H H H H H H H H H H H H H H H H H H H H H H H H
charge: 0
multiplicity: 1
keywords: wb97x-d3
keywords: def2-TZVPP
keywords: def2/J RIJCOSX
keywords: DEFGRID2
keywords: scfconv7
keywords: smallprint printgap noloewdin
keywords: NOSOSCF
formula: C19H26O3
InChI: InChI=1/C19H26O3/c1-7-8-13-12(4)16(10-15(13)20)22-18(21)17-14(9-11(2)3)19(17,5)6/h7,9,14,16-17H,1,8,10H2,2-6H3
48 atoms
O  -0.093647 0.328705 0.276286
O  1.182113 -1.156864 -0.815775
O  -4.520639 -0.130632 1.561319
C  3.334855 1.061945 -0.895181
C  3.525001 0.390311 0.419946
C  2.132968 0.881448 0.010122
C  3.47062 0.291323 -2.185536
C  3.827806 2.486472 -1.011916
C  3.842398 -1.051852 0.551648
C  1.065565 -0.104744 -0.246234
C  3.645633 -1.773226 1.655121
C  -1.241241 -0.516244 0.199666
C  3.010401 -1.225412 2.896412
C  4.039159 -3.216887 1.723334
C  -2.101066 -0.349045 1.445792
C  -2.139753 -0.116218 -0.946764
C  -3.406816 0.058624 -0.547393
C  -3.506376 -0.134009 0.912855
C  -1.594985 -0.000763 -2.324283
C  -4.610535 0.431634 -1.349521
C  -4.829923 1.916926 -1.305723
C  -5.811188 2.512488 -0.643612
H  3.965531 1.015867 1.191905
H  1.788242 1.776714 0.514601
H  4.516766 0.286854 -2.497888
H  3.132541 -0.737737 -2.119137
H  2.896471 0.775619 -2.977382
H  3.727488 3.032904 -0.073165
H  4.882452 2.504365 -1.292388
H  3.271181 3.032994 -1.775161
H  4.28749 -1.539683 -0.308527
H  -0.919326 -1.55276 0.067051
H  2.698734 -0.187454 2.796591
H  3.692836 -1.292334 3.747544
H  2.126493 -1.810351 3.163162
H  3.170558 -3.849361 1.922686
H  4.748463 -3.395186 2.535566
H  4.496745 -3.560319 0.796664
H  -1.798265 0.535504 2.01052
H  -2.060807 -1.199346 2.126503
H  -2.378068 0.167444 -3.0613
H  -0.893118 0.833257 -2.393179
H  -1.040701 -0.898275 -2.601854
H  -5.483659 -0.082301 -0.942811
H  -4.496063 0.101131 -2.384998
H  -4.100234 2.519373 -1.838672
H  -5.911979 3.589177 -0.629503
H  -6.542383 1.945279 -0.081889
totalener: -965.40197819 hartree
nucrepener: 1815.73460501 hartree
electener: -2781.13658320 hartree
oneelecener: -4917.72626006 hartree
twoeener: 2136.58967685 hartree
kineticenergy: 961.04603546 hartree
xcener: -95.138877614924 hartree
chargesum: -0.0000000
charge: -0.282497 -0.385690 -0.328057 0.137106 -0.070147 -0.099670 -0.282725 -0.238799 -0.160738 0.331409 -0.013974 0.234337 -0.254403 -0.208812 -0.138379 -0.073795 -0.033949 0.221489 -0.248926 -0.129875 -0.149087 -0.193346 0.096446 0.083007 0.091550 0.105341 0.082621 0.071590 0.089373 0.089203 0.083255 0.096995 0.081727 0.096489 0.087250 0.085465 0.083292 0.078659 0.088159 0.084525 0.091150 0.099031 0.118599 0.093027 0.097681 0.104385 0.099298 0.090410
qa: -0.2825 -0.3857 -0.3281 0.1371 -0.0701 -0.0997 -0.2827 -0.2388 -0.1607 0.3314 -0.0140 0.2343 -0.2544 -0.2088 -0.1384 -0.0738 -0.0339 0.2215 -0.2489 -0.1299 -0.1491 -0.1933 0.0964 0.0830 0.0916 0.1053 0.0826 0.0716 0.0894 0.0892 0.0833 0.0970 0.0817 0.0965 0.0872 0.0855 0.0833 0.0787 0.0882 0.0845 0.0911 0.0990 0.1186 0.0930 0.0977 0.1044 0.0993 0.0904
va: 2.1128 2.0925 2.1706 3.7490 3.8949 3.8395 3.9102 3.9002 3.8886 4.1556 3.7638 3.7653 3.9480 3.9422 3.8724 3.7562 3.3971 4.1321 3.9459 3.8883 3.8429 3.9775 1.0037 1.0321 0.9984 1.0195 1.0054 1.0075 1.0046 1.0052 1.0124 1.0287 1.0088 1.0006 1.0001 0.9995 0.9978 1.0113 1.0324 1.0296 1.0074 1.0004 1.0078 1.0274 1.0045 1.0090 1.0074 1.0197
dispcorr: -0.023165607 hartree
energy: -965.425143798360
dipole: 17.04229 -15.81828 1.22400 1.45120 -1.06912 0.38208 -3.22988 2.73327 -0.49661
magnitude: 1.37506 au
magnitude: 3.49512 debye
