program: Orca
programVersion: 5.0.2
elementType: O O O C C C C C C C C C C C C C C C C C C C H H H H H H H H H H H H H H H H H H H H H H H H H H
charge: 0
multiplicity: 1
keywords: wb97x-d3
keywords: def2-TZVPP
keywords: def2/J RIJCOSX
keywords: DEFGRID2
keywords: scfconv7
keywords: smallprint printgap noloewdin
keywords: NOSOSCF
formula: C19H26O3
InChI: InChI=1/C19H26O3/c1-7-8-13-12(4)16(10-15(13)20)22-18(21)17-14(9-11(2)3)19(17,5)6/h7,9,14,16-17H,1,8,10H2,2-6H3
48 atoms
O  0.030756 1.599152 1.26917
O  0.206991 0.695426 -0.76466
O  -3.987862 1.556154 -1.202729
C  3.229177 1.309181 -0.588865
C  3.053191 0.005518 0.111483
C  2.175471 1.21058 0.496171
C  2.858985 1.479364 -2.041639
C  4.440209 2.128463 -0.204117
C  2.482175 -1.19608 -0.540406
C  0.732714 1.137549 0.228594
C  2.147629 -2.319119 0.102828
C  -1.393784 1.488704 1.256491
C  2.277704 -2.490269 1.586515
C  1.615847 -3.510312 -0.633523
C  -2.136796 2.281416 0.184872
C  -1.896747 0.073546 1.117193
C  -2.923682 -0.008921 0.257267
C  -3.138417 1.296835 -0.375886
C  -1.301645 -1.02494 1.913259
C  -3.751244 -1.20813 -0.062634
C  -3.127156 -2.202873 -0.997961
C  -1.904763 -2.160131 -1.513645
H  3.794444 -0.205846 0.876259
H  2.430444 1.681163 1.43841
H  2.600795 2.519824 -2.247471
H  3.719132 1.228668 -2.665877
H  2.026708 0.864897 -2.369653
H  4.703626 2.003502 0.847064
H  5.306455 1.832899 -0.79923
H  4.264998 3.191851 -0.379056
H  2.357295 -1.169318 -1.617747
H  -1.668451 1.849311 2.250682
H  3.164412 -3.081088 1.832947
H  1.424168 -3.036368 1.992868
H  2.352758 -1.545775 2.122639
H  0.604661 -3.755996 -0.296685
H  2.226384 -4.397698 -0.443844
H  1.581891 -3.349667 -1.711176
H  -1.489877 2.651928 -0.610733
H  -2.656453 3.147743 0.597922
H  -1.090753 -0.707962 2.935916
H  -1.946443 -1.901569 1.945689
H  -0.349268 -1.337597 1.478044
H  -4.706494 -0.887361 -0.489136
H  -4.017494 -1.732372 0.861859
H  -3.772032 -3.038917 -1.252949
H  -1.561404 -2.94067 -2.180711
H  -1.208374 -1.356927 -1.310211
elementType: O C H
totalener: -965.42290899 hartree
nucrepener: 1919.39172785 hartree
electener: -2884.81463684 hartree
oneelecener: -5125.82560494 hartree
twoeener: 2241.01096809 hartree
cpcmener: -0.03021908 hartree
kineticenergy: 960.99969290 hartree
xcener: -95.144697257364 hartree
chargesum: -0.0000000
charge: -0.303209 -0.470534 -0.452280 0.135855 -0.041997 -0.087731 -0.296472 -0.261513 -0.239221 0.376388 -0.026645 0.311398 -0.294387 -0.239917 -0.156742 -0.019444 -0.129330 0.288529 -0.249773 -0.091518 -0.174531 -0.288583 0.111852 0.090980 0.100604 0.099183 0.094269 0.086547 0.094858 0.095579 0.122495 0.117385 0.118558 0.096367 0.096694 0.087506 0.107491 0.094592 0.110674 0.106958 0.121305 0.111903 0.083522 0.089204 0.102782 0.130263 0.128326 0.111756
qa: -0.3032 -0.4705 -0.4523 0.1359 -0.0420 -0.0877 -0.2965 -0.2615 -0.2392 0.3764 -0.0266 0.3114 -0.2944 -0.2399 -0.1567 -0.0194 -0.1293 0.2885 -0.2498 -0.0915 -0.1745 -0.2886 0.1119 0.0910 0.1006 0.0992 0.0943 0.0865 0.0949 0.0956 0.1225 0.1174 0.1186 0.0964 0.0967 0.0875 0.1075 0.0946 0.1107 0.1070 0.1213 0.1119 0.0835 0.0892 0.1028 0.1303 0.1283 0.1118
va: 2.1325 2.0136 2.0555 3.7763 3.8005 3.8594 3.8950 3.8923 3.8397 4.0894 3.6815 3.7460 3.9390 3.9210 3.8501 3.6600 3.4356 4.0682 3.9461 3.8536 3.8402 3.8907 1.0016 1.0320 0.9997 0.9991 1.0207 1.0048 1.0024 1.0027 1.0040 0.9917 0.9967 0.9959 1.0010 0.9957 0.9974 1.0056 1.0296 1.0226 1.0045 1.0022 0.9971 1.0212 1.0002 0.9998 1.0045 1.0163
dispcorr: -0.027678911 hartree
energy: -965.450587899817
dipole: 16.95421 -15.13658 1.81764 -12.86386 12.27957 -0.58429 1.29543 1.15136 2.44679
magnitude: 3.10354 au
magnitude: 7.88857 debye
