program: Orca
programVersion: 5.0.2
elementType: O O O C C C C C C C C C C C C C C C C C C C H H H H H H H H H H H H H H H H H H H H H H H H H H
charge: 0
multiplicity: 1
keywords: wb97x-d3
keywords: def2-TZVPP
keywords: def2/J RIJCOSX
keywords: DEFGRID2
keywords: scfconv7
keywords: smallprint printgap noloewdin
keywords: NOSOSCF
formula: C19H26O3
InChI: InChI=1/C19H26O3/c1-7-8-13-12(4)16(10-15(13)20)22-18(21)17-14(9-11(2)3)19(17,5)6/h7,9,14,16-17H,1,8,10H2,2-6H3
48 atoms
O  0.198187 0.797807 0.735101
O  0.883964 2.710842 1.650489
O  -3.736012 1.609061 -1.379563
C  2.938882 1.272687 -0.795753
C  2.936562 0.005552 0.003236
C  2.502711 1.311049 0.658857
C  1.930626 1.498077 -1.89607
C  4.278024 1.90489 -1.089566
C  2.045978 -1.13704 -0.301243
C  1.132665 1.682809 1.063972
C  2.115905 -2.347314 0.262501
C  -1.163545 1.102856 1.056862
C  3.060571 -2.718284 1.364334
C  1.216308 -3.458243 -0.189746
C  -1.823119 2.03926 0.051153
C  -1.921896 -0.193477 0.947275
C  -2.925259 -0.116079 0.061011
C  -2.944956 1.220086 -0.547312
C  -1.520024 -1.365814 1.760318
C  -3.87011 -1.193435 -0.342468
C  -3.329737 -2.117782 -1.396204
C  -2.119781 -2.075791 -1.940679
H  3.921739 -0.289363 0.350233
H  3.230775 1.755443 1.328873
H  1.766133 2.567252 -2.044932
H  2.308674 1.092216 -2.83664
H  0.959737 1.041719 -1.715783
H  4.182153 2.983474 -1.230951
H  4.992724 1.738223 -0.282495
H  4.707739 1.487914 -2.003129
H  1.308199 -0.995678 -1.084152
H  -1.218994 1.488703 2.078173
H  2.514208 -3.167654 2.197694
H  3.623959 -1.875732 1.761184
H  3.778591 -3.471558 1.0278
H  1.796394 -4.303012 -0.572567
H  0.52897 -3.141755 -0.974937
H  0.620455 -3.847914 0.640115
H  -1.136615 2.361999 -0.734807
H  -2.223024 2.940908 0.517371
H  -0.581266 -1.784931 1.389824
H  -1.346595 -1.077638 2.799156
H  -2.266233 -2.158233 1.740869
H  -4.801296 -0.752102 -0.710278
H  -4.160645 -1.791432 0.526926
H  -4.024258 -2.886975 -1.720656
H  -1.828569 -2.79368 -2.696867
H  -1.378608 -1.334147 -1.666842
elementType: O C H
totalener: -965.42407148 hartree
nucrepener: 1904.37000860 hartree
electener: -2869.79408009 hartree
oneelecener: -5094.66127610 hartree
twoeener: 2224.86719601 hartree
cpcmener: -0.03145193 hartree
kineticenergy: 960.99185370 hartree
xcener: -95.140130960132 hartree
chargesum: -0.0000000
charge: -0.263963 -0.466952 -0.444694 0.114031 0.008795 -0.107799 -0.284655 -0.261548 -0.269690 0.385988 -0.020619 0.225573 -0.268752 -0.250461 -0.151399 -0.052413 -0.084047 0.312441 -0.256366 -0.071373 -0.172263 -0.277102 0.108600 0.098454 0.106541 0.107077 0.073978 0.094658 0.086154 0.093491 0.118936 0.108004 0.094157 0.090643 0.100283 0.111565 0.088052 0.092505 0.104345 0.109017 0.093034 0.120488 0.106849 0.090820 0.103106 0.131006 0.132843 0.092660
qa: -0.2640 -0.4670 -0.4447 0.1140 0.0088 -0.1078 -0.2847 -0.2615 -0.2697 0.3860 -0.0206 0.2256 -0.2688 -0.2505 -0.1514 -0.0524 -0.0840 0.3124 -0.2564 -0.0714 -0.1723 -0.2771 0.1086 0.0985 0.1065 0.1071 0.0740 0.0947 0.0862 0.0935 0.1189 0.1080 0.0942 0.0906 0.1003 0.1116 0.0881 0.0925 0.1043 0.1090 0.0930 0.1205 0.1068 0.0908 0.1031 0.1310 0.1328 0.0927
va: 2.1208 2.0353 2.0639 3.7935 3.7310 3.8544 3.9116 3.8969 3.8607 4.1646 3.6795 3.7526 3.9489 3.9228 3.8924 3.7284 3.4332 4.0576 3.9607 3.8340 3.8470 3.8911 1.0029 1.0256 0.9997 1.0013 1.0088 1.0024 1.0056 1.0017 0.9960 1.0204 0.9972 1.0070 0.9958 0.9981 1.0055 0.9934 1.0226 1.0225 0.9984 1.0025 1.0033 1.0197 1.0012 1.0018 1.0039 1.0232
dispcorr: -0.027295205 hartree
energy: -965.451366687267
dipole: 14.01257 -12.72931 1.28325 -15.88341 13.88825 -1.99516 -3.40921 4.26337 0.85416
magnitude: 2.52131 au
magnitude: 6.40865 debye
