program: Orca
programVersion: 5.0.2
elementType: O O O C C C C C C C C C C C C C C C C C C C H H H H H H H H H H H H H H H H H H H H H H H H H H
charge: 0
multiplicity: 1
keywords: wb97x-d3
keywords: def2-TZVPP
keywords: def2/J RIJCOSX
keywords: DEFGRID2
keywords: scfconv7
keywords: smallprint printgap noloewdin
keywords: NOSOSCF
formula: C19H26O3
InChI: InChI=1/C19H26O3/c1-7-8-13-12(4)16(10-15(13)20)22-18(21)17-14(9-11(2)3)19(17,5)6/h7,9,14,16-17H,1,8,10H2,2-6H3
48 atoms
O  -0.039473 0.249832 0.21822
O  1.304946 -0.803861 -1.22967
O  -4.328406 -0.763238 1.53414
C  3.41604 1.368592 -0.57365
C  3.522642 0.421017 0.570078
C  2.150846 0.964983 0.157715
C  3.695975 0.907814 -1.982984
C  3.857096 2.793579 -0.329587
C  3.897196 -1.004369 0.388908
C  1.139145 0.04301 -0.386167
C  3.433222 -2.021037 1.119299
C  -1.149174 -0.600354 -0.086195
C  2.409358 -1.862543 2.200751
C  3.90503 -3.424042 0.889105
C  -1.931606 -0.915699 1.180623
C  -2.127844 0.114853 -0.98559
C  -3.367382 0.113803 -0.470121
C  -3.356597 -0.546452 0.84231
C  -1.675748 0.687086 -2.276627
C  -4.623236 0.709919 -1.020061
C  -4.871298 2.049308 -0.387133
C  -5.82906 2.305232 0.494634
H  3.864063 0.861357 1.503958
H  1.739805 1.713056 0.825784
H  3.115877 1.491201 -2.700866
H  4.751751 1.067995 -2.211833
H  3.479741 -0.141587 -2.159252
H  3.359238 3.483055 -1.014525
H  3.640408 3.122018 0.687952
H  4.933472 2.891789 -0.485494
H  4.633481 -1.217537 -0.381167
H  -0.795403 -1.511012 -0.574261
H  2.126793 -0.827084 2.382576
H  2.777136 -2.276464 3.143463
H  1.500952 -2.420771 1.956494
H  4.619992 -3.488481 0.068833
H  3.06664 -4.086739 0.658925
H  4.382839 -3.830204 1.784785
H  -1.592995 -0.306678 2.022341
H  -1.85738 -1.960622 1.483662
H  -2.504921 1.047641 -2.882599
H  -0.997854 1.528235 -2.110891
H  -1.121803 -0.053356 -2.856787
H  -5.464481 0.040804 -0.824878
H  -4.54679 0.820439 -2.103888
H  -4.179412 2.837587 -0.67013
H  -5.941816 3.289025 0.932738
H  -6.533231 1.545855 0.814883
elementType: O C H
totalener: -965.42541795 hartree
nucrepener: 1827.41849794 hartree
electener: -2792.84391589 hartree
oneelecener: -4941.36346062 hartree
twoeener: 2148.51954473 hartree
cpcmener: -0.02989182 hartree
kineticenergy: 960.99071666 hartree
xcener: -95.136775149945 hartree
chargesum: 0.0000000
charge: -0.297080 -0.461175 -0.447507 0.137433 -0.016258 -0.112921 -0.299615 -0.265191 -0.281847 0.378590 -0.010938 0.255471 -0.267331 -0.221750 -0.138187 -0.051785 -0.068861 0.284352 -0.251071 -0.104608 -0.175001 -0.274581 0.112499 0.094411 0.099026 0.097991 0.097888 0.094776 0.086578 0.094138 0.119416 0.104293 0.092351 0.109207 0.097111 0.089059 0.093594 0.095478 0.100248 0.099316 0.104960 0.111468 0.113319 0.094999 0.109581 0.139200 0.128146 0.110810
qa: -0.2971 -0.4612 -0.4475 0.1374 -0.0163 -0.1129 -0.2996 -0.2652 -0.2818 0.3786 -0.0109 0.2555 -0.2673 -0.2217 -0.1382 -0.0518 -0.0689 0.2844 -0.2511 -0.1046 -0.1750 -0.2746 0.1125 0.0944 0.0990 0.0980 0.0979 0.0948 0.0866 0.0941 0.1194 0.1043 0.0924 0.1092 0.0971 0.0891 0.0936 0.0955 0.1002 0.0993 0.1050 0.1115 0.1133 0.0950 0.1096 0.1392 0.1281 0.1108
va: 2.1044 2.0254 2.0535 3.7372 3.8315 3.8343 3.8948 3.9016 3.8753 4.1001 3.6976 3.7476 3.9443 3.9249 3.9003 3.7782 3.4330 4.0879 3.9400 3.8582 3.7878 3.9477 1.0052 1.0321 1.0012 0.9986 1.0149 1.0026 1.0048 1.0022 1.0024 1.0308 1.0076 0.9990 0.9982 1.0070 0.9972 0.9964 1.0303 1.0247 1.0057 0.9992 1.0058 1.0212 1.0068 1.0013 1.0033 1.0152
dispcorr: -0.023983736 hartree
energy: -965.449401688003
dipole: 15.59168 -14.04746 1.54422 2.74169 -1.90273 0.83896 -2.35447 1.74934 -0.60512
magnitude: 1.85867 au
magnitude: 4.72436 debye
