program: Orca
programVersion: 5.0.2
elementType: O O O C C C C C C C C C C C C C C C C C C C H H H H H H H H H H H H H H H H H H H H H H H H H H
charge: 0
multiplicity: 1
keywords: wb97x-d3
keywords: def2-TZVPP
keywords: def2/J RIJCOSX
keywords: DEFGRID2
keywords: scfconv7
keywords: smallprint printgap noloewdin
keywords: NOSOSCF
formula: C19H26O3
InChI: InChI=1/C19H26O3/c1-7-8-13-12(4)16(10-15(13)20)22-18(21)17-14(9-11(2)3)19(17,5)6/h7,9,14,16-17H,1,8,10H2,2-6H3
48 atoms
O  -0.114821 0.179661 0.244673
O  1.173003 -0.743816 -1.338049
O  -4.352218 -0.917592 1.641318
C  3.330323 1.333324 -0.566215
C  3.438973 0.312951 0.513415
C  2.06989 0.905377 0.157345
C  3.587405 0.96582 -2.007097
C  3.789808 2.735035 -0.235733
C  3.772661 -1.107651 0.239919
C  1.037982 0.029663 -0.421616
C  3.364097 -2.141007 0.980556
C  -1.244527 -0.626771 -0.100734
C  2.451365 -1.997971 2.159585
C  3.777634 -3.543979 0.659093
C  -1.979214 -1.071483 1.156197
C  -2.25072 0.189898 -0.872534
C  -3.469437 0.138464 -0.312631
C  -3.411048 -0.646888 0.926158
C  -1.853239 0.912606 -2.103805
C  -4.726608 0.786037 -0.779303
C  -4.920289 2.189594 -0.281463
C  -4.061744 2.900575 0.438865
H  3.801614 0.685068 1.468374
H  1.681512 1.616001 0.877869
H  3.007023 1.603245 -2.676891
H  4.642376 1.129572 -2.236812
H  3.357246 -0.066286 -2.253405
H  3.267839 3.472989 -0.84845
H  3.614428 2.989263 0.81066
H  4.859466 2.842974 -0.426654
H  4.419294 -1.306262 -0.609905
H  -0.921978 -1.481471 -0.699346
H  2.845567 -2.537121 3.024692
H  1.473533 -2.439296 1.944477
H  2.289105 -0.963671 2.457962
H  4.410643 -3.594915 -0.226761
H  2.905141 -4.179911 0.487135
H  4.32611 -3.99248 1.491837
H  -1.593632 -0.565037 2.044295
H  -1.911082 -2.144594 1.338284
H  -1.168404 1.730587 -1.866184
H  -1.324691 0.250107 -2.7921
H  -2.708152 1.340461 -2.624371
H  -5.586056 0.185906 -0.465064
H  -4.76961 0.79568 -1.872554
H  -5.868342 2.639741 -0.560675
H  -4.299036 3.913042 0.740482
H  -3.096876 2.517638 0.749854
elementType: O C H
totalener: -965.42549634 hartree
nucrepener: 1838.93031171 hartree
electener: -2804.35580806 hartree
oneelecener: -4964.29416536 hartree
twoeener: 2159.93835730 hartree
cpcmener: -0.02989146 hartree
kineticenergy: 960.99219344 hartree
xcener: -95.138670471648 hartree
chargesum: -0.0000000
charge: -0.298218 -0.462767 -0.446268 0.142310 -0.021922 -0.117040 -0.298913 -0.264960 -0.279198 0.386941 -0.008546 0.262650 -0.271010 -0.222875 -0.142570 -0.048913 -0.100602 0.299587 -0.246257 -0.074266 -0.188102 -0.270866 0.110029 0.092736 0.099269 0.098309 0.095417 0.095527 0.086344 0.093957 0.120334 0.107425 0.106667 0.098593 0.094179 0.088994 0.093707 0.095206 0.099276 0.100109 0.112274 0.117626 0.104227 0.092303 0.102300 0.130626 0.130113 0.106254
qa: -0.2982 -0.4628 -0.4463 0.1423 -0.0219 -0.1170 -0.2989 -0.2650 -0.2792 0.3869 -0.0085 0.2626 -0.2710 -0.2229 -0.1426 -0.0489 -0.1006 0.2996 -0.2463 -0.0743 -0.1881 -0.2709 0.1100 0.0927 0.0993 0.0983 0.0954 0.0955 0.0863 0.0940 0.1203 0.1074 0.1067 0.0986 0.0942 0.0890 0.0937 0.0952 0.0993 0.1001 0.1123 0.1176 0.1042 0.0923 0.1023 0.1306 0.1301 0.1063
va: 2.1061 2.0268 2.0599 3.7384 3.8294 3.8389 3.8949 3.9006 3.8677 4.1074 3.6982 3.7331 3.9486 3.9259 3.8850 3.7478 3.4435 4.0674 3.9373 3.8287 3.8455 3.9013 1.0059 1.0314 1.0010 0.9987 1.0154 1.0025 1.0046 1.0024 1.0018 1.0321 1.0001 0.9965 1.0061 1.0072 0.9964 0.9968 1.0294 1.0241 0.9991 1.0058 1.0037 1.0190 1.0003 1.0027 1.0044 1.0209
dispcorr: -0.024333403 hartree
energy: -965.449829743994
dipole: 16.70992 -15.36161 1.34831 3.50166 -2.64514 0.85652 -2.59661 1.97318 -0.62343
magnitude: 1.71471 au
magnitude: 4.35845 debye
