program: Orca
programVersion: 5.0.2
elementType: O O O C C C C C C C C C C C C C C C C C C C H H H H H H H H H H H H H H H H H H H H H H H H H H
charge: 0
multiplicity: 1
keywords: wb97x-d3
keywords: def2-TZVPP
keywords: def2/J RIJCOSX
keywords: DEFGRID2
keywords: scfconv7
keywords: smallprint printgap noloewdin
keywords: NOSOSCF
formula: C19H26O3
InChI: InChI=1/C19H26O3/c1-7-8-13-12(4)16(10-15(13)20)22-18(21)17-14(9-11(2)3)19(17,5)6/h7,9,14,16-17H,1,8,10H2,2-6H3
48 atoms
O  -0.023518 0.684601 0.178571
O  1.315021 0.010159 -1.472864
O  -3.455106 -2.409289 -0.033188
C  3.566888 1.527412 0.061395
C  3.541254 0.157957 0.643154
C  2.239883 0.95854 0.531233
C  3.854882 1.740674 -1.403667
C  4.114224 2.636412 0.93021
C  3.795839 -1.059673 -0.166152
C  1.178742 0.50304 -0.378932
C  3.301957 -2.271729 0.097477
C  -1.167792 0.283327 -0.575493
C  2.357186 -2.551277 1.225451
C  3.659507 -3.458049 -0.744106
C  -1.409014 -1.221926 -0.575601
C  -2.379121 0.875001 0.09558
C  -3.315181 -0.052858 0.347951
C  -2.827831 -1.372113 -0.075384
C  -2.46287 2.335131 0.334866
C  -4.686826 0.163935 0.908824
C  -5.613214 0.734512 -0.124603
C  -6.253779 1.890802 -0.005888
H  3.878622 0.090617 1.674411
H  1.867438 1.365096 1.464292
H  4.930476 1.855214 -1.548651
H  3.523627 0.931074 -2.046416
H  3.380514 2.658344 -1.756075
H  3.692446 3.602672 0.645937
H  3.894994 2.475938 1.986613
H  5.198999 2.704071 0.824734
H  4.467078 -0.951998 -1.013409
H  -1.088387 0.676699 -1.593812
H  1.469652 -3.077048 0.863177
H  2.025641 -1.653731 1.7453
H  2.819766 -3.211067 1.965053
H  4.116187 -4.247325 -0.140965
H  4.354386 -3.201226 -1.543579
H  2.767689 -3.895902 -1.200325
H  -0.729898 -1.740142 0.107156
H  -1.29242 -1.678332 -1.558723
H  -2.464966 2.869821 -0.619134
H  -3.360579 2.61725 0.880365
H  -1.595992 2.695282 0.891618
H  -4.64331 0.825733 1.77636
H  -5.080275 -0.793547 1.261959
H  -5.74235 0.14198 -1.026216
H  -6.907053 2.256915 -0.7881
H  -6.152389 2.514128 0.875298
elementType: O C H
totalener: -965.42633025 hartree
nucrepener: 1821.36194739 hartree
electener: -2786.78827764 hartree
oneelecener: -4929.21401888 hartree
twoeener: 2142.42574124 hartree
cpcmener: -0.02931589 hartree
kineticenergy: 960.99800523 hartree
xcener: -95.137846684176 hartree
chargesum: -0.0000000
charge: -0.297749 -0.461916 -0.450110 0.129176 -0.021639 -0.074773 -0.298598 -0.263202 -0.266326 0.354895 -0.009078 0.254124 -0.283403 -0.223345 -0.136012 -0.068499 -0.060110 0.301710 -0.253444 -0.096649 -0.179777 -0.283489 0.113981 0.093352 0.098762 0.096303 0.099420 0.095279 0.086039 0.094236 0.119400 0.101990 0.094613 0.093121 0.114999 0.094619 0.087927 0.094900 0.098656 0.103133 0.115389 0.094056 0.113098 0.104498 0.095095 0.143016 0.129333 0.113001
qa: -0.2977 -0.4619 -0.4501 0.1292 -0.0216 -0.0748 -0.2986 -0.2632 -0.2663 0.3549 -0.0091 0.2541 -0.2834 -0.2233 -0.1360 -0.0685 -0.0601 0.3017 -0.2534 -0.0966 -0.1798 -0.2835 0.1140 0.0934 0.0988 0.0963 0.0994 0.0953 0.0860 0.0942 0.1194 0.1020 0.0946 0.0931 0.1150 0.0946 0.0879 0.0949 0.0987 0.1031 0.1154 0.0941 0.1131 0.1045 0.0951 0.1430 0.1293 0.1130
va: 2.1151 2.0280 2.0570 3.7440 3.8292 3.8277 3.8978 3.8994 3.8626 4.1073 3.6910 3.7721 3.9430 3.9254 3.8798 3.7773 3.4368 4.0693 3.9449 3.8529 3.7942 3.9390 1.0041 1.0293 0.9982 1.0162 1.0009 1.0024 1.0048 1.0021 1.0012 1.0181 0.9975 1.0059 0.9990 0.9958 1.0075 0.9972 1.0285 1.0250 0.9961 1.0062 1.0104 1.0042 1.0257 1.0032 1.0041 1.0092
dispcorr: -0.023697982 hartree
energy: -965.450028230284
dipole: 12.73445 -11.81161 0.92285 5.42079 -3.38127 2.03952 2.42554 -1.52750 0.89804
magnitude: 2.41201 au
magnitude: 6.13083 debye
