program: Orca
programVersion: 5.0.2
elementType: O O O C C C C C C C C C C C C C C C C C C C H H H H H H H H H H H H H H H H H H H H H H H H H H
charge: 0
multiplicity: 1
keywords: wb97x-d3
keywords: def2-TZVPP
keywords: def2/J RIJCOSX
keywords: DEFGRID2
keywords: scfconv7
keywords: smallprint printgap noloewdin
keywords: NOSOSCF
formula: C19H26O3
InChI: InChI=1/C19H26O3/c1-7-8-13-12(4)16(10-15(13)20)22-18(21)17-14(9-11(2)3)19(17,5)6/h7,9,14,16-17H,1,8,10H2,2-6H3
48 atoms
O  -0.290813 0.614268 0.266879
O  1.087818 0.745655 -1.479587
O  -4.08178 -1.270329 -1.59127
C  3.306496 1.038444 0.716763
C  3.237702 -0.42978 0.436291
C  1.952922 0.352517 0.731195
C  3.676416 2.026032 -0.362146
C  3.816509 1.451222 2.077558
C  3.537587 -1.0119 -0.8848
C  0.92236 0.5894 -0.293026
C  4.090856 -2.209076 -1.114251
C  -1.409847 0.879845 -0.580796
C  4.481639 -3.207401 -0.067546
C  4.371178 -2.654278 -2.519107
C  -1.85579 -0.314106 -1.416579
C  -2.580121 1.194349 0.31184
C  -3.662292 0.469247 -0.009935
C  -3.319538 -0.48023 -1.075673
C  -2.454789 2.21852 1.376103
C  -5.021274 0.518611 0.611965
C  -5.107311 -0.407071 1.789668
C  -5.347933 -0.018165 3.035501
H  3.514945 -1.053037 1.278884
H  1.541691 0.182382 1.719317
H  3.382993 1.732133 -1.365326
H  3.223932 2.998671 -0.158633
H  4.759322 2.165449 -0.367892
H  3.542213 0.735031 2.853292
H  4.905599 1.531035 2.070747
H  3.414434 2.424594 2.366437
H  3.309412 -0.406154 -1.752835
H  -1.190107 1.74964 -1.207773
H  5.5395 -3.467907 -0.162822
H  3.924269 -4.138773 -0.20265
H  4.316675 -2.871857 0.954798
H  3.871475 -3.601558 -2.739838
H  5.440158 -2.828585 -2.670887
H  4.043082 -1.922632 -3.257619
H  -1.318479 -1.224604 -1.139196
H  -1.71796 -0.168899 -2.488345
H  -1.890196 1.821095 2.2232
H  -1.909812 3.09361 1.017324
H  -3.423106 2.544061 1.751985
H  -5.76499 0.228085 -0.135858
H  -5.262571 1.537565 0.920417
H  -4.946875 -1.460928 1.580075
H  -5.393958 -0.730678 3.849549
H  -5.5164 1.022491 3.28915
elementType: O C H
totalener: -965.42772861 hartree
nucrepener: 1783.80014869 hartree
electener: -2749.22787730 hartree
oneelecener: -4854.06096286 hartree
twoeener: 2104.83308556 hartree
cpcmener: -0.02915433 hartree
kineticenergy: 960.98801377 hartree
xcener: -95.136561544152 hartree
chargesum: 0.0000000
charge: -0.296595 -0.471132 -0.450851 0.097183 0.027379 -0.070329 -0.281494 -0.262071 -0.284539 0.384232 -0.061317 0.247096 -0.254056 -0.216635 -0.144145 -0.051405 -0.046924 0.295161 -0.271383 -0.106316 -0.174755 -0.283456 0.116909 0.094655 0.095500 0.100544 0.097814 0.086181 0.095104 0.093321 0.120945 0.103107 0.094864 0.096974 0.087561 0.091581 0.092685 0.087591 0.102840 0.102121 0.114080 0.117159 0.099238 0.098723 0.103631 0.141977 0.129489 0.111755
qa: -0.2966 -0.4711 -0.4509 0.0972 0.0274 -0.0703 -0.2815 -0.2621 -0.2845 0.3842 -0.0613 0.2471 -0.2541 -0.2166 -0.1441 -0.0514 -0.0469 0.2952 -0.2714 -0.1063 -0.1748 -0.2835 0.1169 0.0947 0.0955 0.1005 0.0978 0.0862 0.0951 0.0933 0.1209 0.1031 0.0949 0.0970 0.0876 0.0916 0.0927 0.0876 0.1028 0.1021 0.1141 0.1172 0.0992 0.0987 0.1036 0.1420 0.1295 0.1118
va: 2.1290 2.0282 2.0520 3.7238 3.7391 3.8491 3.9046 3.9088 3.8479 4.0982 3.7944 3.7778 3.9387 3.9218 3.8947 3.7602 3.4262 4.0687 3.9509 3.8606 3.7945 3.9481 1.0017 1.0285 1.0152 0.9988 1.0004 1.0055 1.0018 1.0026 1.0221 1.0160 0.9969 0.9967 1.0141 0.9968 0.9961 1.0093 1.0249 1.0248 0.9996 1.0010 1.0054 1.0216 1.0046 1.0047 1.0035 1.0098
dispcorr: -0.021818441 hartree
energy: -965.449547047664
dipole: 19.11392 -17.81848 1.29544 -0.21455 1.47304 1.25850 7.94886 -6.05902 1.88984
magnitude: 2.61409 au
magnitude: 6.64449 debye
