program: Orca
programVersion: 5.0.2
elementType: O O O C C C C C C C C C C C C C C C C C C C H H H H H H H H H H H H H H H H H H H H H H H H H H
charge: 0
multiplicity: 1
keywords: wb97x-d3
keywords: def2-TZVPP
keywords: def2/J RIJCOSX
keywords: DEFGRID2
keywords: scfconv7
keywords: smallprint printgap noloewdin
keywords: NOSOSCF
formula: C19H26O3
InChI: InChI=1/C19H26O3/c1-7-8-13-12(4)16(10-15(13)20)22-18(21)17-14(9-11(2)3)19(17,5)6/h7,9,14,16-17H,1,8,10H2,2-6H3
48 atoms
O  0.319028 0.896309 0.26844
O  0.818687 1.98947 2.153186
O  -3.698035 0.580693 -1.980209
C  3.424813 1.404538 -0.131528
C  3.095424 -0.049883 -0.05744
C  2.56013 0.893289 1.01039
C  2.818058 2.264103 -1.212739
C  4.818545 1.836823 0.253473
C  2.286386 -0.737356 -1.0971
C  1.159692 1.317175 1.206594
C  1.660797 -1.904837 -0.935008
C  -1.051345 1.304892 0.304243
C  1.608427 -2.630477 0.373934
C  0.952906 -2.57452 -2.072592
C  -1.589464 1.413035 -1.115326
C  -1.915365 0.258406 0.966256
C  -2.9575 -0.085387 0.192759
C  -2.875738 0.622529 -1.089915
C  -1.607404 -0.253544 2.32312
C  -4.050851 -1.050403 0.50072
C  -3.683115 -2.493669 0.305049
C  -2.478638 -2.967289 0.011215
H  3.895997 -0.666808 0.343903
H  3.075648 0.846226 1.963463
H  3.445966 2.237495 -2.105759
H  1.817159 1.960692 -1.512767
H  2.762452 3.304631 -0.886543
H  4.823504 2.863556 0.625381
H  5.241774 1.199566 1.031092
H  5.486973 1.793864 -0.609319
H  2.260478 -0.274668 -2.07966
H  -1.142473 2.253334 0.839275
H  1.975637 -2.034614 1.208424
H  2.201138 -3.549063 0.336057
H  0.585426 -2.937951 0.606053
H  1.334972 -3.586319 -2.233785
H  1.061147 -2.023079 -3.006795
H  -0.115785 -2.679201 -1.866478
H  -0.907011 0.948601 -1.832127
H  -1.757662 2.439822 -1.440911
H  -2.363874 -0.952286 2.675674
H  -0.646323 -0.773582 2.336317
H  -1.53328 0.565125 3.041333
H  -4.921241 -0.825363 -0.122494
H  -4.396409 -0.918705 1.531016
H  -4.506019 -3.190482 0.433607
H  -2.30988 -4.030839 -0.099684
H  -1.619148 -2.322692 -0.126527
elementType: O C H
totalener: -965.42161171 hartree
nucrepener: 1911.69412652 hartree
electener: -2877.11573823 hartree
oneelecener: -5109.33483503 hartree
twoeener: 2232.21909680 hartree
cpcmener: -0.02992809 hartree
kineticenergy: 960.99352069 hartree
xcener: -95.140641940027 hartree
chargesum: -0.0000000
charge: -0.260024 -0.469732 -0.446635 0.129421 -0.008018 -0.164427 -0.292062 -0.266236 -0.247759 0.419036 -0.031510 0.214297 -0.284210 -0.231812 -0.136910 -0.038661 -0.080454 0.291190 -0.252511 -0.072998 -0.188682 -0.228915 0.115176 0.097216 0.102824 0.086557 0.103316 0.094990 0.086193 0.093295 0.124123 0.108643 0.095661 0.113432 0.091593 0.099071 0.091026 0.093734 0.098365 0.102761 0.102583 0.110599 0.123338 0.091031 0.101930 0.130944 0.136635 0.052579
qa: -0.2600 -0.4697 -0.4466 0.1294 -0.0080 -0.1644 -0.2921 -0.2662 -0.2478 0.4190 -0.0315 0.2143 -0.2842 -0.2318 -0.1369 -0.0387 -0.0805 0.2912 -0.2525 -0.0730 -0.1887 -0.2289 0.1152 0.0972 0.1028 0.0866 0.1033 0.0950 0.0862 0.0933 0.1241 0.1086 0.0957 0.1134 0.0916 0.0991 0.0910 0.0937 0.0984 0.1028 0.1026 0.1106 0.1233 0.0910 0.1019 0.1309 0.1366 0.0526
va: 2.1182 2.0322 2.0622 3.7570 3.7743 3.9007 3.9166 3.9038 3.8417 4.1091 3.6912 3.7610 3.9514 3.9271 3.8923 3.7017 3.4064 4.0715 3.9392 3.8437 3.9044 3.8927 1.0017 1.0273 0.9990 1.0053 1.0018 1.0021 1.0055 1.0018 0.9972 1.0291 1.0028 1.0002 0.9940 0.9962 1.0082 0.9895 1.0257 1.0241 1.0045 0.9958 1.0074 1.0228 0.9985 1.0014 0.9999 1.0393
dispcorr: -0.027783539 hartree
energy: -965.449395249871
dipole: 12.93969 -11.61351 1.32618 -9.96816 9.31942 -0.64874 -1.12298 1.81273 0.68975
magnitude: 1.62953 au
magnitude: 4.14193 debye
