program: Orca
programVersion: 5.0.2
elementType: O O O C C C C C C C C C C C C C C C C C C C H H H H H H H H H H H H H H H H H H H H H H H H H H
charge: 0
multiplicity: 1
keywords: wb97x-d3
keywords: def2-TZVPP
keywords: def2/J RIJCOSX
keywords: DEFGRID2
keywords: scfconv7
keywords: smallprint printgap noloewdin
keywords: NOSOSCF
formula: C19H26O3
InChI: InChI=1/C19H26O3/c1-7-8-13-12(4)16(10-15(13)20)22-18(21)17-14(9-11(2)3)19(17,5)6/h7,9,14,16-17H,1,8,10H2,2-6H3
48 atoms
O  0.0027 0.769553 -0.115164
O  1.34078 -0.684102 -1.149792
O  -3.688962 -1.864396 0.835646
C  3.59972 1.364408 -0.428665
C  3.567226 0.37988 0.68769
C  2.269188 1.04583 0.235049
C  3.889704 0.911452 -1.837995
C  4.141053 2.743328 -0.132513
C  3.86149 -1.061326 0.481454
C  1.206326 0.273767 -0.426933
C  3.282233 -2.075568 1.127278
C  -1.140091 0.12667 -0.680548
C  2.175936 -1.903326 2.120984
C  3.695394 -3.493804 0.877305
C  -1.512725 -1.186787 -0.002795
C  -2.321766 1.033493 -0.459516
C  -3.345211 0.388179 0.119679
C  -2.962889 -1.004646 0.383936
C  -2.274473 2.440704 -0.923681
C  -4.71179 0.89782 0.419285
C  -5.717345 0.631537 -0.663529
C  -5.475531 0.088667 -1.85016
H  3.897186 0.769038 1.648292
H  1.8943 1.817518 0.897396
H  3.410802 1.575057 -2.560854
H  4.965583 0.955122 -2.02007
H  3.564015 -0.102551 -2.052669
H  3.928146 3.056217 0.890687
H  5.224756 2.765654 -0.266013
H  3.709906 3.488031 -0.804657
H  4.649256 -1.291024 -0.230996
H  -0.986976 -0.008009 -1.755953
H  2.452815 -2.335286 3.086562
H  1.280115 -2.43906 1.794408
H  1.902326 -0.863377 2.290976
H  4.036489 -3.974029 1.798292
H  4.498189 -3.565586 0.143262
H  2.853045 -4.088524 0.51368
H  -0.919696 -1.358004 0.899939
H  -1.385146 -2.057908 -0.645543
H  -3.241981 2.934032 -0.854901
H  -1.557432 3.020584 -0.338253
H  -1.940094 2.488903 -1.962354
H  -4.686553 1.973272 0.616659
H  -5.075569 0.446445 1.347633
H  -6.733418 0.926908 -0.419448
H  -6.275323 -0.057401 -2.564989
H  -4.487409 -0.229546 -2.161109
elementType: O C H
totalener: -965.42639028 hartree
nucrepener: 1831.62522241 hartree
electener: -2797.05161270 hartree
oneelecener: -4949.88706779 hartree
twoeener: 2152.83545510 hartree
cpcmener: -0.03143821 hartree
kineticenergy: 960.99537620 hartree
xcener: -95.139397198320 hartree
chargesum: 0.0000000
charge: -0.296852 -0.460955 -0.445357 0.122729 -0.014419 -0.078605 -0.297773 -0.264822 -0.271946 0.352710 -0.012179 0.253751 -0.276228 -0.224382 -0.129346 -0.039441 -0.080170 0.286828 -0.256071 -0.081496 -0.183760 -0.270848 0.114530 0.094599 0.100371 0.098629 0.099105 0.086608 0.093968 0.095191 0.120069 0.100605 0.112105 0.095533 0.094299 0.094950 0.088480 0.094994 0.096412 0.103723 0.097904 0.113193 0.111423 0.099698 0.095396 0.129990 0.130272 0.106588
qa: -0.2969 -0.4610 -0.4454 0.1227 -0.0144 -0.0786 -0.2978 -0.2648 -0.2719 0.3527 -0.0122 0.2538 -0.2762 -0.2244 -0.1293 -0.0394 -0.0802 0.2868 -0.2561 -0.0815 -0.1838 -0.2708 0.1145 0.0946 0.1004 0.0986 0.0991 0.0866 0.0940 0.0952 0.1201 0.1006 0.1121 0.0955 0.0943 0.0949 0.0885 0.0950 0.0964 0.1037 0.0979 0.1132 0.1114 0.0997 0.0954 0.1300 0.1303 0.1066
va: 2.1199 2.0287 2.0614 3.7364 3.8334 3.8309 3.8997 3.9019 3.8658 4.1014 3.6898 3.7827 3.9422 3.9258 3.8703 3.7290 3.4434 4.0839 3.9533 3.8284 3.8337 3.9086 1.0038 1.0298 1.0008 0.9987 1.0146 1.0051 1.0021 1.0023 1.0007 1.0195 1.0002 0.9979 1.0053 0.9965 1.0073 0.9970 1.0293 1.0251 1.0044 1.0023 0.9983 1.0019 1.0148 1.0029 1.0041 1.0166
dispcorr: -0.024213623 hartree
energy: -965.450603906248
dipole: 13.66812 -12.66964 0.99848 4.01574 -1.67422 2.34153 -0.84747 0.82607 -0.02140
magnitude: 2.54562 au
magnitude: 6.47045 debye
