program: Orca
programVersion: 5.0.2
elementType: O O O C C C C C C C C C C C C C C C C C C C H H H H H H H H H H H H H H H H H H H H H H H H H H
charge: 0
multiplicity: 1
keywords: wb97x-d3
keywords: def2-TZVPP
keywords: def2/J RIJCOSX
keywords: DEFGRID2
keywords: scfconv7
keywords: smallprint printgap noloewdin
keywords: NOSOSCF
formula: C19H26O3
InChI: InChI=1/C19H26O3/c1-7-8-13-12(4)16(10-15(13)20)22-18(21)17-14(9-11(2)3)19(17,5)6/h7,9,14,16-17H,1,8,10H2,2-6H3
48 atoms
O  -0.143732 0.770519 0.368448
O  1.206883 1.026027 -1.388108
O  -3.65293 -1.643089 -1.320716
C  3.515037 1.182867 0.698969
C  3.337952 -0.263863 0.399018
C  2.121599 0.586882 0.786515
C  3.882617 2.161138 -0.38912
C  4.128986 1.535387 2.034079
C  3.51229 -0.826598 -0.963255
C  1.064096 0.828427 -0.205314
C  2.931897 -1.943405 -1.408661
C  -1.282492 0.904207 -0.484861
C  1.96773 -2.751139 -0.596855
C  3.205728 -2.46918 -2.783952
C  -1.594474 -0.359573 -1.278436
C  -2.481787 1.119166 0.398975
C  -3.458263 0.235219 0.144906
C  -3.005477 -0.719998 -0.87413
C  -2.497557 2.222638 1.38764
C  -4.799051 0.144256 0.786414
C  -4.810081 -0.555592 2.114752
C  -3.756027 -1.01206 2.779869
H  3.622379 -0.937516 1.20324
H  1.75065 0.426103 1.792025
H  3.510706 3.158694 -0.14751
H  4.970019 2.228765 -0.464657
H  3.502885 1.897534 -1.371831
H  3.848255 0.825864 2.813757
H  5.218837 1.535205 1.964878
H  3.817967 2.529497 2.361399
H  4.192622 -0.301309 -1.627344
H  -1.150372 1.772139 -1.137628
H  1.702746 -2.283603 0.350054
H  2.379594 -3.739949 -0.376398
H  1.044011 -2.924487 -1.155177
H  3.591293 -3.491597 -2.746993
H  3.928518 -1.856627 -3.323015
H  2.288307 -2.507366 -3.377517
H  -0.919665 -1.180907 -1.023263
H  -1.53126 -0.21391 -2.357372
H  -2.213402 3.166381 0.917032
H  -3.474211 2.348122 1.851327
H  -1.7725 2.040084 2.18377
H  -5.491953 -0.371967 0.115149
H  -5.22399 1.14412 0.920093
H  -5.797309 -0.678319 2.550233
H  -3.877397 -1.502262 3.737461
H  -2.743051 -0.929241 2.404092
elementType: O C H
totalener: -965.42664261 hartree
nucrepener: 1844.06235144 hartree
electener: -2809.48899405 hartree
oneelecener: -4974.73504105 hartree
twoeener: 2165.24604701 hartree
cpcmener: -0.03043319 hartree
kineticenergy: 961.00148261 hartree
xcener: -95.140132156792 hartree
chargesum: -0.0000000
charge: -0.300941 -0.462307 -0.446250 0.133490 -0.025474 -0.082592 -0.299063 -0.262802 -0.263937 0.357738 -0.008615 0.266637 -0.286129 -0.223534 -0.142116 -0.062004 -0.081648 0.300651 -0.261895 -0.070714 -0.187822 -0.272802 0.113851 0.095856 0.099678 0.098937 0.095934 0.086032 0.094565 0.094671 0.120270 0.105337 0.093626 0.115758 0.094147 0.093810 0.088270 0.095395 0.097465 0.105082 0.118738 0.100396 0.111588 0.091028 0.102872 0.130867 0.129975 0.107983
qa: -0.3009 -0.4623 -0.4462 0.1335 -0.0255 -0.0826 -0.2991 -0.2628 -0.2639 0.3577 -0.0086 0.2666 -0.2861 -0.2235 -0.1421 -0.0620 -0.0816 0.3007 -0.2619 -0.0707 -0.1878 -0.2728 0.1139 0.0959 0.0997 0.0989 0.0959 0.0860 0.0946 0.0947 0.1203 0.1053 0.0936 0.1158 0.0941 0.0938 0.0883 0.0954 0.0975 0.1051 0.1187 0.1004 0.1116 0.0910 0.1029 0.1309 0.1300 0.1080
va: 2.1140 2.0271 2.0637 3.7433 3.8255 3.8373 3.8971 3.8991 3.8594 4.1086 3.6890 3.7493 3.9443 3.9258 3.8750 3.7355 3.4437 4.0676 3.9515 3.8277 3.8452 3.9008 1.0040 1.0276 1.0007 0.9980 1.0162 1.0047 1.0020 1.0028 1.0007 1.0186 1.0053 0.9989 0.9973 0.9960 1.0075 0.9971 1.0306 1.0240 0.9994 1.0031 1.0012 1.0211 0.9991 1.0025 1.0049 1.0206
dispcorr: -0.024237383 hartree
energy: -965.450879990722
dipole: 14.38510 -13.62828 0.75682 -0.08289 1.45505 1.37217 5.70763 -4.04571 1.66192
magnitude: 2.28421 au
magnitude: 5.80599 debye
