program: Orca
programVersion: 5.0.2
elementType: O O O C C C C C C C C C C C C C C C C C C C H H H H H H H H H H H H H H H H H H H H H H H H H H
charge: 0
multiplicity: 1
keywords: wb97x-d3
keywords: def2-TZVPP
keywords: def2/J RIJCOSX
keywords: DEFGRID2
keywords: scfconv7
keywords: smallprint printgap noloewdin
keywords: NOSOSCF
formula: C19H26O3
InChI: InChI=1/C19H26O3/c1-7-8-13-12(4)16(10-15(13)20)22-18(21)17-14(9-11(2)3)19(17,5)6/h7,9,14,16-17H,1,8,10H2,2-6H3
48 atoms
O  -0.061111 1.598438 1.249174
O  0.115087 0.537932 -0.705544
O  -4.06896 1.732206 -1.263255
C  3.14867 1.18854 -0.53793
C  3.017334 -0.063572 0.269243
C  2.083872 1.127813 0.538404
C  2.799359 1.217579 -2.005593
C  4.320913 2.083064 -0.205063
C  2.526456 -1.340396 -0.279405
C  0.641116 1.04172 0.257796
C  2.924968 -2.563277 0.091717
C  -1.488997 1.575999 1.20304
C  3.952221 -2.865695 1.139791
C  2.325504 -3.780707 -0.547325
C  -2.148389 2.364266 0.074856
C  -2.093636 0.195981 1.124087
C  -3.128226 0.157498 0.269426
C  -3.236845 1.443234 -0.428495
C  -1.59244 -0.902669 1.983084
C  -4.059413 -0.976977 0.002732
C  -3.570927 -1.99107 -0.990199
C  -2.377471 -2.024515 -1.569456
H  3.756407 -0.163188 1.055774
H  2.312851 1.676713 1.444375
H  2.481319 2.218648 -2.303177
H  3.688351 0.971599 -2.589936
H  2.017244 0.524203 -2.298961
H  4.111174 3.121053 -0.471328
H  4.567821 2.056021 0.857169
H  5.208881 1.771589 -0.759217
H  1.772729 -1.286356 -1.055561
H  -1.761948 2.005426 2.169927
H  4.472245 -1.98985 1.525317
H  4.710293 -3.548363 0.745202
H  3.495437 -3.378406 1.992654
H  3.087832 -4.373758 -1.060091
H  1.550877 -3.529535 -1.272325
H  1.879927 -4.438148 0.204631
H  -1.464029 2.611247 -0.737782
H  -2.581456 3.303645 0.421865
H  -2.280656 -1.745977 2.010227
H  -0.6335 -1.276882 1.614075
H  -1.42405 -0.558578 3.005408
H  -5.017839 -0.583129 -0.349161
H  -4.294116 -1.497718 0.936846
H  -4.291606 -2.767657 -1.229471
H  -2.125307 -2.812263 -2.268195
H  -1.610928 -1.285056 -1.376653
elementType: O C H
totalener: -965.42409582 hartree
nucrepener: 1872.14572348 hartree
electener: -2837.56981930 hartree
oneelecener: -5031.29478191 hartree
twoeener: 2193.72496261 hartree
cpcmener: -0.02974046 hartree
kineticenergy: 960.98016449 hartree
xcener: -95.140464536764 hartree
chargesum: 0.0000000
charge: -0.302573 -0.474191 -0.451895 0.102325 0.046391 -0.100003 -0.281950 -0.261935 -0.311278 0.395233 -0.047334 0.310991 -0.256248 -0.218387 -0.161451 -0.018687 -0.139811 0.294548 -0.256881 -0.092222 -0.183750 -0.279262 0.114860 0.092586 0.099889 0.095897 0.095757 0.093557 0.086266 0.095486 0.123851 0.118205 0.088403 0.094039 0.098477 0.094756 0.087713 0.091451 0.112263 0.106215 0.104727 0.112207 0.118388 0.090280 0.102041 0.131203 0.126437 0.113418
qa: -0.3026 -0.4742 -0.4519 0.1023 0.0464 -0.1000 -0.2820 -0.2619 -0.3113 0.3952 -0.0473 0.3110 -0.2562 -0.2184 -0.1615 -0.0187 -0.1398 0.2945 -0.2569 -0.0922 -0.1837 -0.2793 0.1149 0.0926 0.0999 0.0959 0.0958 0.0936 0.0863 0.0955 0.1239 0.1182 0.0884 0.0940 0.0985 0.0948 0.0877 0.0915 0.1123 0.1062 0.1047 0.1122 0.1184 0.0903 0.1020 0.1312 0.1264 0.1134
va: 2.1333 2.0184 2.0549 3.7271 3.7227 3.8610 3.9010 3.9039 3.8729 4.0845 3.7755 3.7362 3.9393 3.9227 3.8596 3.6728 3.4480 4.0646 3.9425 3.8463 3.8481 3.8943 1.0017 1.0317 0.9993 1.0011 1.0167 1.0026 1.0056 1.0018 1.0128 0.9915 1.0134 0.9973 0.9962 0.9971 1.0090 0.9961 1.0277 1.0239 1.0021 0.9970 1.0008 1.0192 0.9996 0.9999 1.0058 1.0205
dispcorr: -0.024747167 hartree
energy: -965.448842987473
dipole: 19.73542 -17.84449 1.89093 -13.78125 13.28243 -0.49882 0.72179 1.69195 2.41374
magnitude: 3.10654 au
magnitude: 7.89620 debye
