program: Orca
programVersion: 5.0.2
elementType: O O O C C C C C C C C C C C C C C C C C C C H H H H H H H H H H H H H H H H H H H H H H H H H H
charge: 0
multiplicity: 1
keywords: wb97x-d3
keywords: def2-TZVPP
keywords: def2/J RIJCOSX
keywords: DEFGRID2
keywords: scfconv7
keywords: smallprint printgap noloewdin
keywords: NOSOSCF
formula: C19H26O3
InChI: InChI=1/C19H26O3/c1-7-8-13-12(4)16(10-15(13)20)22-18(21)17-14(9-11(2)3)19(17,5)6/h7,9,14,16-17H,1,8,10H2,2-6H3
48 atoms
O  -0.137469 0.798469 0.421095
O  1.189191 1.142009 -1.338519
O  -3.607667 -1.566204 -1.40373
C  3.535705 1.168792 0.707059
C  3.324798 -0.263941 0.364253
C  2.132789 0.598396 0.801018
C  3.90668 2.173867 -0.355143
C  4.179196 1.464717 2.042094
C  3.456547 -0.785992 -1.018856
C  1.062802 0.886933 -0.1648
C  2.854171 -1.885518 -1.478153
C  -1.286276 0.97101 -0.41235
C  1.914703 -2.71343 -0.657144
C  3.07772 -2.371233 -2.877141
C  -1.581164 -0.237537 -1.294178
C  -2.481455 1.09527 0.495086
C  -3.440889 0.2098 0.186859
C  -2.97711 -0.661272 -0.899923
C  -2.511249 2.122828 1.561852
C  -4.77169 0.038686 0.833073
C  -4.754688 -0.793904 2.082869
C  -3.685389 -1.299843 2.684265
H  3.609873 -0.969398 1.140344
H  1.774641 0.411544 1.806677
H  3.560341 3.170807 -0.076106
H  4.993906 2.220688 -0.446623
H  3.505466 1.949673 -1.339038
H  3.894107 2.453761 2.406308
H  3.896334 0.736102 2.803196
H  5.267516 1.444521 1.954426
H  4.118192 -0.243945 -1.688123
H  -1.174897 1.88649 -1.001075
H  1.657814 -2.256537 0.297184
H  2.345389 -3.697093 -0.449509
H  0.984864 -2.897735 -1.201262
H  2.140528 -2.381929 -3.440215
H  3.453296 -3.398024 -2.884286
H  3.788694 -1.749102 -3.420864
H  -0.885318 -1.060518 -1.111822
H  -1.537624 -0.008494 -2.359546
H  -1.774486 1.897431 2.336132
H  -2.252055 3.104921 1.160158
H  -3.485545 2.191781 2.041923
H  -5.46816 -0.416042 0.12222
H  -5.20628 1.013977 1.073624
H  -5.734079 -0.974112 2.516002
H  -3.785385 -1.884455 3.589872
H  -2.678944 -1.160884 2.307392
elementType: O C H
totalener: -965.42669606 hartree
nucrepener: 1846.41852293 hartree
electener: -2811.84521899 hartree
oneelecener: -4979.46478966 hartree
twoeener: 2167.61957067 hartree
cpcmener: -0.03051013 hartree
kineticenergy: 961.00053730 hartree
xcener: -95.139879344469 hartree
chargesum: -0.0000000
charge: -0.300788 -0.461946 -0.445965 0.133501 -0.026673 -0.081071 -0.298275 -0.262441 -0.264640 0.355954 -0.007536 0.268010 -0.288743 -0.223399 -0.141201 -0.058558 -0.086676 0.300243 -0.260449 -0.071959 -0.187921 -0.271925 0.113653 0.095891 0.099324 0.098716 0.095761 0.095006 0.085902 0.094617 0.120523 0.106233 0.094068 0.117056 0.094319 0.095393 0.094020 0.088179 0.096648 0.104943 0.111100 0.118104 0.100218 0.091421 0.102965 0.130850 0.129900 0.107645
qa: -0.3008 -0.4619 -0.4460 0.1335 -0.0267 -0.0811 -0.2983 -0.2624 -0.2646 0.3560 -0.0075 0.2680 -0.2887 -0.2234 -0.1412 -0.0586 -0.0867 0.3002 -0.2604 -0.0720 -0.1879 -0.2719 0.1137 0.0959 0.0993 0.0987 0.0958 0.0950 0.0859 0.0946 0.1205 0.1062 0.0941 0.1171 0.0943 0.0954 0.0940 0.0882 0.0966 0.1049 0.1111 0.1181 0.1002 0.0914 0.1030 0.1309 0.1299 0.1076
va: 2.1134 2.0282 2.0636 3.7465 3.8232 3.8350 3.8962 3.8982 3.8583 4.1123 3.6881 3.7474 3.9443 3.9260 3.8737 3.7398 3.4461 4.0673 3.9517 3.8262 3.8451 3.9002 1.0039 1.0275 1.0009 0.9981 1.0165 1.0027 1.0048 1.0020 1.0011 1.0179 1.0052 0.9985 0.9972 0.9970 0.9958 1.0076 1.0301 1.0241 1.0015 0.9991 1.0034 1.0204 0.9994 1.0025 1.0047 1.0209
dispcorr: -0.024292437 hartree
energy: -965.450988500824
dipole: 14.22680 -13.49438 0.73241 -0.73251 2.00990 1.27739 5.70003 -3.93342 1.76661
magnitude: 2.29980 au
magnitude: 5.84562 debye
