program: Orca
programVersion: 5.0.2
elementType: O O O C C C C C C C C C C C C C C C C C C C H H H H H H H H H H H H H H H H H H H H H H H H H H
charge: 0
multiplicity: 1
keywords: wb97x-d3
keywords: def2-TZVPP
keywords: def2/J RIJCOSX
keywords: DEFGRID2
keywords: scfconv7
keywords: smallprint printgap noloewdin
keywords: NOSOSCF
formula: C19H26O3
InChI: InChI=1/C19H26O3/c1-7-8-13-12(4)16(10-15(13)20)22-18(21)17-14(9-11(2)3)19(17,5)6/h7,9,14,16-17H,1,8,10H2,2-6H3
48 atoms
O  -0.126759 0.80851 0.461437
O  1.175605 1.243141 -1.295984
O  -3.58534 -1.473501 -1.508466
C  3.559329 1.159715 0.702404
C  3.315519 -0.26162 0.33449
C  2.148169 0.614751 0.808902
C  3.935838 2.178031 -0.345168
C  4.22993 1.41496 2.03261
C  3.408625 -0.756325 -1.061656
C  1.06586 0.936165 -0.133095
C  2.769344 -1.830813 -1.530484
C  -1.286399 1.012792 -0.349814
C  1.830574 -2.654644 -0.704042
C  2.948709 -2.292014 -2.944052
C  -1.569577 -0.138573 -1.308933
C  -2.474189 1.052952 0.574928
C  -3.423216 0.176507 0.212917
C  -2.959622 -0.603487 -0.940932
C  -2.507186 1.998414 1.715345
C  -4.744393 -0.061288 0.858144
C  -4.700587 -0.968655 2.054049
C  -3.617226 -1.491993 2.613765
H  3.600305 -0.98916 1.090023
H  1.802456 0.412737 1.816032
H  3.61714 3.176592 -0.040249
H  5.022223 2.202101 -0.453351
H  3.513926 1.983337 -1.326614
H  3.972325 2.402773 2.41994
H  3.942179 0.6781 2.783918
H  5.316077 1.372304 1.927696
H  4.06912 -0.21538 -1.732921
H  -1.19701 1.967685 -0.876729
H  0.893699 -2.829607 -1.239484
H  1.587166 -2.200222 0.255298
H  2.25613 -3.642763 -0.504575
H  1.998845 -2.26516 -3.484966
H  3.2956 -3.328226 -2.981303
H  3.664027 -1.677653 -3.490857
H  -0.865093 -0.96431 -1.179493
H  -1.529692 0.15892 -2.357325
H  -1.76749 1.717763 2.469003
H  -2.253526 3.009768 1.389131
H  -3.480913 2.025391 2.201206
H  -5.438333 -0.485086 0.126053
H  -5.195937 0.888415 1.161989
H  -5.67266 -1.191857 2.483779
H  -3.69773 -2.130623 3.484292
H  -2.616891 -1.310021 2.238849
elementType: O C H
totalener: -965.42664639 hartree
nucrepener: 1849.40527634 hartree
electener: -2814.83192274 hartree
oneelecener: -4985.42229974 hartree
twoeener: 2170.59037700 hartree
cpcmener: -0.03046956 hartree
kineticenergy: 960.99552588 hartree
xcener: -95.138972623211 hartree
chargesum: -0.0000000
charge: -0.299935 -0.460984 -0.446632 0.133463 -0.025047 -0.081058 -0.297729 -0.262775 -0.267946 0.354400 -0.005296 0.267081 -0.292699 -0.223046 -0.140948 -0.057795 -0.088612 0.302059 -0.260961 -0.071164 -0.187006 -0.273061 0.113362 0.095846 0.098961 0.098585 0.095644 0.095252 0.085905 0.094671 0.121120 0.106568 0.095078 0.095045 0.118494 0.095262 0.094463 0.088176 0.096571 0.104619 0.110937 0.118219 0.100473 0.090969 0.102949 0.130705 0.129949 0.107866
qa: -0.2999 -0.4610 -0.4466 0.1335 -0.0250 -0.0811 -0.2977 -0.2628 -0.2679 0.3544 -0.0053 0.2671 -0.2927 -0.2230 -0.1409 -0.0578 -0.0886 0.3021 -0.2610 -0.0712 -0.1870 -0.2731 0.1134 0.0958 0.0990 0.0986 0.0956 0.0953 0.0859 0.0947 0.1211 0.1066 0.0951 0.0950 0.1185 0.0953 0.0945 0.0882 0.0966 0.1046 0.1109 0.1182 0.1005 0.0910 0.1029 0.1307 0.1299 0.1079
va: 2.1123 2.0299 2.0633 3.7490 3.8203 3.8318 3.8952 3.8979 3.8593 4.1151 3.6840 3.7495 3.9443 3.9263 3.8726 3.7398 3.4471 4.0634 3.9517 3.8267 3.8446 3.9000 1.0040 1.0274 1.0009 0.9981 1.0168 1.0027 1.0047 1.0020 1.0012 1.0171 0.9966 1.0051 0.9982 0.9969 0.9956 1.0076 1.0297 1.0249 1.0012 0.9992 1.0033 1.0211 0.9993 1.0025 1.0047 1.0208
dispcorr: -0.024430268 hartree
energy: -965.451076662009
dipole: 14.07931 -13.35148 0.72783 -1.29629 2.45672 1.16043 5.77528 -3.89828 1.87699
magnitude: 2.32367 au
magnitude: 5.90630 debye
