program: Orca
programVersion: 5.0.2
elementType: O O O C C C C C C C C C C C C C C C C C C C H H H H H H H H H H H H H H H H H H H H H H H H H H
charge: 0
multiplicity: 1
keywords: wb97x-d3
keywords: def2-TZVPP
keywords: def2/J RIJCOSX
keywords: DEFGRID2
keywords: scfconv7
keywords: smallprint printgap noloewdin
keywords: NOSOSCF
formula: C19H26O3
InChI: InChI=1/C19H26O3/c1-7-8-13-12(4)16(10-15(13)20)22-18(21)17-14(9-11(2)3)19(17,5)6/h7,9,14,16-17H,1,8,10H2,2-6H3
48 atoms
O  -0.018887 0.814886 0.310825
O  1.238428 0.313183 -1.461025
O  -3.43016 -2.259277 -0.327305
C  3.612819 1.512332 0.145741
C  3.519597 0.100884 0.608311
C  2.26576 0.983774 0.603283
C  3.881806 1.833645 -1.303438
C  4.243628 2.508645 1.090814
C  3.6744 -1.054324 -0.3105
C  1.156978 0.672234 -0.310605
C  3.107649 -2.250575 -0.135323
C  -1.199402 0.529013 -0.442071
C  2.183414 -2.566981 0.99961
C  3.351052 -3.376354 -1.092465
C  -1.423022 -0.953115 -0.72036
C  -2.377934 0.95215 0.396224
C  -3.280583 -0.032126 0.524063
C  -2.809719 -1.226773 -0.186928
C  -2.469502 2.339205 0.910591
C  -4.607476 0.010759 1.199491
C  -5.737232 0.457889 0.317706
C  -5.638098 0.920629 -0.922277
H  3.876085 -0.076656 1.619876
H  1.942969 1.32392 1.580331
H  3.492708 1.099209 -2.002223
H  3.452245 2.802029 -1.567124
H  4.959843 1.900751 -1.464936
H  5.327373 2.529101 0.958091
H  3.867543 3.516891 0.905803
H  4.043722 2.265857 2.135435
H  4.322457 -0.91387 -1.170716
H  -1.186398 1.111454 -1.368953
H  1.208121 -2.889201 0.62355
H  2.020119 -1.72618 1.671629
H  2.569692 -3.399497 1.594154
H  2.413324 -3.719276 -1.53806
H  3.784673 -4.241404 -0.583413
H  4.022538 -3.090813 -1.902275
H  -0.706042 -1.582184 -0.185429
H  -1.353982 -1.209528 -1.777551
H  -1.652398 2.560293 1.600409
H  -2.382948 3.052027 0.086843
H  -3.409237 2.529049 1.425298
H  -4.570284 0.664372 2.076176
H  -4.847755 -0.980917 1.594504
H  -6.719902 0.39176 0.775169
H  -6.52026 1.226848 -1.470155
H  -4.691522 1.012638 -1.441681
elementType: O C H
totalener: -965.42640705 hartree
nucrepener: 1836.00519232 hartree
electener: -2801.43159938 hartree
oneelecener: -4958.61611375 hartree
twoeener: 2157.18451437 hartree
cpcmener: -0.03130498 hartree
kineticenergy: 960.99703551 hartree
xcener: -95.139689044542 hartree
chargesum: 0.0000000
charge: -0.296860 -0.461412 -0.446707 0.135166 -0.024516 -0.079921 -0.300254 -0.264108 -0.268978 0.357399 -0.009941 0.254250 -0.280090 -0.223018 -0.127046 -0.051223 -0.085402 0.293812 -0.251496 -0.082065 -0.184820 -0.273742 0.113724 0.093298 0.096402 0.099663 0.098388 0.094100 0.095522 0.086045 0.120142 0.102981 0.095236 0.093621 0.114423 0.094699 0.094657 0.088215 0.097879 0.101840 0.113923 0.112436 0.097875 0.101147 0.094513 0.130293 0.130741 0.109207
qa: -0.2969 -0.4614 -0.4467 0.1352 -0.0245 -0.0799 -0.3003 -0.2641 -0.2690 0.3574 -0.0099 0.2543 -0.2801 -0.2230 -0.1270 -0.0512 -0.0854 0.2938 -0.2515 -0.0821 -0.1848 -0.2737 0.1137 0.0933 0.0964 0.0997 0.0984 0.0941 0.0955 0.0860 0.1201 0.1030 0.0952 0.0936 0.1144 0.0947 0.0947 0.0882 0.0979 0.1018 0.1139 0.1124 0.0979 0.1011 0.0945 0.1303 0.1307 0.1092
va: 2.1183 2.0304 2.0619 3.7377 3.8271 3.8309 3.8969 3.8993 3.8636 4.1088 3.6935 3.7849 3.9429 3.9256 3.8618 3.7527 3.4431 4.0709 3.9473 3.8323 3.8330 3.9072 1.0046 1.0286 1.0162 1.0009 0.9983 1.0021 1.0024 1.0048 1.0012 1.0174 0.9957 1.0063 0.9992 0.9971 0.9962 1.0074 1.0311 1.0266 1.0044 0.9975 1.0044 1.0007 1.0167 1.0028 1.0043 1.0154
dispcorr: -0.024233168 hartree
energy: -965.450640223110
dipole: 12.77636 -11.91736 0.85900 3.68599 -1.75136 1.93463 2.41998 -0.99214 1.42783
magnitude: 2.55331 au
magnitude: 6.49000 debye
