program: Orca
programVersion: 5.0.2
elementType: O O O C C C C C C C C C C C C C C C C C C C H H H H H H H H H H H H H H H H H H H H H H H H H H
charge: 0
multiplicity: 1
keywords: wb97x-d3
keywords: def2-TZVPP
keywords: def2/J RIJCOSX
keywords: DEFGRID2
keywords: scfconv7
keywords: smallprint printgap noloewdin
keywords: NOSOSCF
formula: C19H26O3
InChI: InChI=1/C19H26O3/c1-7-8-13-12(4)16(10-15(13)20)22-18(21)17-14(9-11(2)3)19(17,5)6/h7,9,14,16-17H,1,8,10H2,2-6H3
48 atoms
O  0.340454 0.602677 0.392879
O  0.788296 1.854158 2.179064
O  -3.991224 2.019222 -0.482674
C  3.00677 1.446634 -0.769927
C  3.311028 0.238233 0.048588
C  2.545496 1.408488 0.676449
C  2.037261 1.392236 -1.925743
C  4.146678 2.406095 -1.028336
C  2.705332 -1.091975 -0.203664
C  1.157335 1.317594 1.157845
C  2.729282 -2.111194 0.659769
C  -1.026584 0.492658 0.797578
C  3.304522 -2.009893 2.038988
C  2.182322 -3.457261 0.295504
C  -1.838097 1.770071 0.611844
C  -1.678693 -0.520489 -0.106964
C  -2.804234 -0.044966 -0.661218
C  -3.022687 1.337933 -0.221348
C  -1.094938 -1.874011 -0.262789
C  -3.772891 -0.769136 -1.5431
C  -4.747143 -1.573922 -0.734431
C  -4.899025 -2.888836 -0.830748
H  4.328421 0.191947 0.427604
H  3.136801 2.014188 1.35343
H  1.273016 0.625399 -1.842985
H  1.529996 2.351248 -2.047686
H  2.58992 1.19905 -2.847491
H  4.844636 2.445981 -0.191017
H  4.709184 2.104867 -1.914465
H  3.774907 3.418348 -1.200413
H  2.262593 -1.258769 -1.181024
H  -1.068043 0.137564 1.832027
H  4.232723 -2.581772 2.117666
H  2.619109 -2.437139 2.774264
H  3.518255 -0.986826 2.342549
H  1.806614 -3.488541 -0.727214
H  1.368585 -3.748247 0.964928
H  2.949847 -4.2302 0.393189
H  -1.276547 2.529822 0.061948
H  -2.16135 2.21981 1.550465
H  -0.857849 -2.303757 0.711778
H  -1.764435 -2.55559 -0.781985
H  -0.158989 -1.831178 -0.82246
H  -3.241708 -1.418364 -2.241882
H  -4.318759 -0.036418 -2.144494
H  -5.34966 -1.017203 -0.022343
H  -5.616706 -3.420111 -0.218427
H  -4.322333 -3.483012 -1.530513
elementType: O C H
totalener: -965.42349749 hartree
nucrepener: 1866.71098423 hartree
electener: -2832.13448172 hartree
oneelecener: -5019.19251306 hartree
twoeener: 2187.05803134 hartree
cpcmener: -0.03027494 hartree
kineticenergy: 961.00246010 hartree
xcener: -95.140249192224 hartree
chargesum: 0.0000000
charge: -0.276202 -0.472940 -0.450722 0.149391 -0.030813 -0.132083 -0.290658 -0.265652 -0.271804 0.409207 0.002335 0.212876 -0.270299 -0.260862 -0.137229 -0.040003 -0.038471 0.303403 -0.289642 -0.102644 -0.178569 -0.284030 0.111542 0.091585 0.082998 0.104102 0.098815 0.086625 0.093592 0.096292 0.127382 0.108980 0.106298 0.095262 0.090780 0.093739 0.094616 0.110201 0.104891 0.100784 0.118498 0.102974 0.109420 0.102646 0.098289 0.142944 0.129696 0.112458
qa: -0.2762 -0.4729 -0.4507 0.1494 -0.0308 -0.1321 -0.2907 -0.2657 -0.2718 0.4092 0.0023 0.2129 -0.2703 -0.2609 -0.1372 -0.0400 -0.0385 0.3034 -0.2896 -0.1026 -0.1786 -0.2840 0.1115 0.0916 0.0830 0.1041 0.0988 0.0866 0.0936 0.0963 0.1274 0.1090 0.1063 0.0953 0.0908 0.0937 0.0946 0.1102 0.1049 0.1008 0.1185 0.1030 0.1094 0.1026 0.0983 0.1429 0.1297 0.1125
va: 2.1093 2.0367 2.0527 3.7303 3.7912 3.8855 3.9108 3.9018 3.8427 4.1177 3.6594 3.7814 3.9496 3.9338 3.9107 3.7066 3.3989 4.0767 3.9624 3.8639 3.7938 3.9456 1.0037 1.0292 1.0089 1.0003 1.0007 1.0054 1.0022 1.0016 0.9960 1.0151 0.9968 0.9988 1.0057 1.0030 0.9941 0.9986 1.0198 1.0267 0.9932 1.0140 0.9991 1.0044 1.0226 1.0047 1.0039 1.0095
dispcorr: -0.025804754 hartree
energy: -965.449302244453
dipole: 14.16914 -12.20915 1.95999 -14.65187 12.61707 -2.03480 -5.16909 4.51403 -0.65506
magnitude: 2.90019 au
magnitude: 7.37169 debye
