program: Orca
programVersion: 5.0.2
elementType: O O O C C C C C C C C C C C C C C C C C C C H H H H H H H H H H H H H H H H H H H H H H H H H H
charge: 0
multiplicity: 1
keywords: wb97x-d3
keywords: def2-TZVPP
keywords: def2/J RIJCOSX
keywords: DEFGRID2
keywords: scfconv7
keywords: smallprint printgap noloewdin
keywords: NOSOSCF
formula: C19H26O3
InChI: InChI=1/C19H26O3/c1-7-8-13-12(4)16(10-15(13)20)22-18(21)17-14(9-11(2)3)19(17,5)6/h7,9,14,16-17H,1,8,10H2,2-6H3
48 atoms
O  -0.010966 0.904802 0.752417
O  1.066382 2.480388 -0.401443
O  -2.785299 -0.953017 -2.086644
C  3.693713 1.09172 0.476303
C  2.976738 -0.158815 0.061654
C  2.281598 0.885634 0.941902
C  4.076136 2.143742 -0.537456
C  4.738671 0.92784 1.556889
C  2.497465 -0.386088 -1.324943
C  1.092882 1.540838 0.35418
C  1.587488 -1.302364 -1.672085
C  -1.26784 1.328787 0.207674
C  0.91433 -2.215794 -0.694125
C  1.169272 -1.4832 -3.099252
C  -1.457186 0.895538 -1.241282
C  -2.315588 0.56781 0.980883
C  -2.986834 -0.293966 0.20217
C  -2.459836 -0.230413 -1.16829
C  -2.478283 0.795136 2.436051
C  -4.044291 -1.269543 0.613351
C  -3.434889 -2.485681 1.246266
C  -3.697993 -2.908001 2.476605
H  3.253695 -1.057268 0.60505
H  2.142831 0.592019 1.9778
H  4.146824 3.124619 -0.063808
H  5.061251 1.908476 -0.945805
H  3.389881 2.235051 -1.374422
H  4.887433 1.86195 2.102648
H  4.459573 0.161804 2.282192
H  5.698864 0.639686 1.12416
H  2.926853 0.22922 -2.109799
H  -1.381351 2.407127 0.346235
H  1.128077 -1.976349 0.3459
H  1.217691 -3.252376 -0.866601
H  -0.170163 -2.191152 -0.82727
H  1.673766 -0.786209 -3.768592
H  0.090664 -1.341281 -3.211249
H  1.38189 -2.498026 -3.446718
H  -0.537169 0.577919 -1.733406
H  -1.876122 1.705446 -1.843136
H  -3.349546 0.285408 2.842636
H  -1.599911 0.441328 2.981475
H  -2.569873 1.862278 2.650421
H  -4.617382 -1.566603 -0.26964
H  -4.74859 -0.802114 1.304702
H  -2.72217 -3.032718 0.635336
H  -3.220596 -3.790276 2.884024
H  -4.39915 -2.391527 3.122734
elementType: O C H
totalener: -965.42313541 hartree
nucrepener: 1896.09181563 hartree
electener: -2861.51495104 hartree
oneelecener: -5078.74140331 hartree
twoeener: 2217.22645228 hartree
cpcmener: -0.02819456 hartree
kineticenergy: 960.99004989 hartree
xcener: -95.135481704140 hartree
chargesum: 0.0000000
charge: -0.275461 -0.443542 -0.453607 0.140225 -0.036741 -0.115522 -0.287850 -0.269653 -0.208566 0.351385 -0.068698 0.253194 -0.268418 -0.219611 -0.157714 -0.050656 -0.050209 0.279870 -0.250902 -0.099644 -0.182307 -0.282899 0.104928 0.100605 0.100369 0.096529 0.084047 0.095248 0.085216 0.094919 0.127441 0.109354 0.090801 0.113917 0.084413 0.091799 0.080406 0.103670 0.103185 0.120530 0.095805 0.112628 0.115242 0.098968 0.103768 0.141413 0.128996 0.113127
qa: -0.2755 -0.4435 -0.4536 0.1402 -0.0367 -0.1155 -0.2878 -0.2697 -0.2086 0.3514 -0.0687 0.2532 -0.2684 -0.2196 -0.1577 -0.0507 -0.0502 0.2799 -0.2509 -0.0996 -0.1823 -0.2829 0.1049 0.1006 0.1004 0.0965 0.0840 0.0952 0.0852 0.0949 0.1274 0.1094 0.0908 0.1139 0.0844 0.0918 0.0804 0.1037 0.1032 0.1205 0.0958 0.1126 0.1152 0.0990 0.1038 0.1414 0.1290 0.1131
va: 2.1126 2.0547 2.0307 3.7681 3.8005 3.8302 3.8982 3.8981 3.7956 4.1929 3.7384 3.7383 3.9510 3.9078 3.9031 3.7954 3.4788 4.0079 3.9430 3.8534 3.7972 3.9436 1.0028 1.0262 1.0018 0.9998 1.0152 1.0027 1.0035 1.0027 0.9997 1.0181 1.0091 1.0011 0.9970 1.0066 1.0118 0.9969 1.0247 1.0185 1.0056 1.0027 1.0009 1.0220 1.0048 1.0051 1.0042 1.0096
dispcorr: -0.026916420 hartree
energy: -965.450051828694
dipole: 10.14757 -9.91199 0.23558 -6.32710 6.44318 0.11608 4.52025 -2.45233 2.06792
magnitude: 2.08453 au
magnitude: 5.29845 debye
