program: Orca
programVersion: 5.0.2
elementType: O O O C C C C C C C C C C C C C C C C C C C H H H H H H H H H H H H H H H H H H H H H H H H H H
charge: 0
multiplicity: 1
keywords: wb97x-d3
keywords: def2-TZVPP
keywords: def2/J RIJCOSX
keywords: DEFGRID2
keywords: scfconv7
keywords: smallprint printgap noloewdin
keywords: NOSOSCF
formula: C19H26O3
InChI: InChI=1/C19H26O3/c1-7-8-13-12(4)16(10-15(13)20)22-18(21)17-14(9-11(2)3)19(17,5)6/h7,9,14,16-17H,1,8,10H2,2-6H3
48 atoms
O  -0.04984 0.935783 0.774935
O  1.043338 2.399057 -0.503612
O  -2.892483 -1.026228 -1.898173
C  3.659156 1.037851 0.417296
C  2.929453 -0.21749 0.047136
C  2.249644 0.856651 0.904531
C  4.038738 2.05565 -0.631846
C  4.714818 0.900377 1.491357
C  2.433605 -0.484851 -1.327128
C  1.063137 1.508993 0.309999
C  1.498304 -1.392601 -1.625158
C  -1.302608 1.369312 0.224051
C  0.818853 -2.245887 -0.598079
C  1.059932 -1.631623 -3.037452
C  -1.526004 0.853774 -1.192894
C  -2.360489 0.687387 1.055468
C  -3.049705 -0.21727 0.34491
C  -2.542732 -0.251009 -1.033691
C  -2.504456 1.01215 2.49445
C  -4.098509 -1.159593 0.823216
C  -3.546811 -2.41392 1.442184
C  -2.271021 -2.6669 1.707883
H  3.204735 -1.101927 0.613984
H  2.119462 0.594275 1.949653
H  4.127011 3.04874 -0.187897
H  5.014831 1.797484 -1.046479
H  3.34144 2.13059 -1.460511
H  4.879518 1.851962 2.001337
H  4.43651 0.163959 2.246874
H  5.666899 0.587163 1.058086
H  2.872804 0.086452 -2.139345
H  -1.376639 2.457238 0.298415
H  1.146259 -3.286558 -0.685253
H  -0.262507 -2.253932 -0.755874
H  1.008225 -1.926072 0.425215
H  1.569528 -0.977641 -3.744991
H  -0.016983 -1.474062 -3.142742
H  1.248662 -2.666029 -3.337926
H  -0.620939 0.494236 -1.683474
H  -1.946843 1.633114 -1.832287
H  -2.633111 2.088417 2.633948
H  -3.349945 0.501883 2.952568
H  -1.603845 0.732145 3.046486
H  -4.750802 -1.440035 -0.009344
H  -4.753461 -0.669746 1.550527
H  -4.293299 -3.162139 1.69094
H  -1.976678 -3.602303 2.166952
H  -1.47628 -1.962037 1.494298
elementType: O C H
totalener: -965.42316747 hartree
nucrepener: 1917.29882450 hartree
electener: -2882.72199197 hartree
oneelecener: -5121.29460912 hartree
twoeener: 2238.57261715 hartree
cpcmener: -0.02882311 hartree
kineticenergy: 960.99258214 hartree
xcener: -95.138910763865 hartree
chargesum: -0.0000000
charge: -0.276850 -0.444355 -0.450673 0.141345 -0.027233 -0.117014 -0.288852 -0.269936 -0.220865 0.349985 -0.052490 0.263734 -0.284967 -0.217170 -0.157676 -0.054967 -0.060606 0.277105 -0.248906 -0.083508 -0.166581 -0.276433 0.105574 0.100082 0.100013 0.096457 0.085136 0.095227 0.085098 0.095104 0.126205 0.108420 0.118173 0.084204 0.092736 0.091144 0.081235 0.103595 0.103048 0.119926 0.116417 0.100001 0.110013 0.092083 0.103109 0.130910 0.129226 0.093774
qa: -0.2768 -0.4444 -0.4507 0.1413 -0.0272 -0.1170 -0.2889 -0.2699 -0.2209 0.3500 -0.0525 0.2637 -0.2850 -0.2172 -0.1577 -0.0550 -0.0606 0.2771 -0.2489 -0.0835 -0.1666 -0.2764 0.1056 0.1001 0.1000 0.0965 0.0851 0.0952 0.0851 0.0951 0.1262 0.1084 0.1182 0.0842 0.0927 0.0911 0.0812 0.1036 0.1030 0.1199 0.1164 0.1000 0.1100 0.0921 0.1031 0.1309 0.1292 0.0938
va: 2.1156 2.0532 2.0340 3.7663 3.7968 3.8294 3.8972 3.8979 3.8031 4.1925 3.7308 3.7507 3.9490 3.9079 3.8955 3.7550 3.4911 3.9973 3.9442 3.8486 3.8304 3.9078 1.0030 1.0263 1.0018 0.9996 1.0156 1.0027 1.0036 1.0025 1.0010 1.0186 1.0015 0.9981 1.0038 1.0067 1.0117 0.9964 1.0260 1.0190 0.9991 1.0034 1.0020 1.0185 1.0005 1.0017 1.0069 1.0206
dispcorr: -0.028067394 hartree
energy: -965.451234865312
dipole: 11.11704 -10.99620 0.12084 -6.06642 6.30596 0.23954 3.83167 -1.71217 2.11950
magnitude: 2.13641 au
magnitude: 5.43032 debye
