program: Orca
programVersion: 5.0.2
elementType: O O O C C C C C C C C C C C C C C C C C C C H H H H H H H H H H H H H H H H H H H H H H H H H H
charge: 0
multiplicity: 1
keywords: wb97x-d3
keywords: def2-TZVPP
keywords: def2/J RIJCOSX
keywords: DEFGRID2
keywords: scfconv7
keywords: smallprint printgap noloewdin
keywords: NOSOSCF
formula: C19H26O3
InChI: InChI=1/C19H26O3/c1-7-8-13-12(4)16(10-15(13)20)22-18(21)17-14(9-11(2)3)19(17,5)6/h7,9,14,16-17H,1,8,10H2,2-6H3
48 atoms
O  -0.084324 0.913104 0.654319
O  1.102441 1.969701 -0.910085
O  -3.257082 -1.177827 -1.763735
C  3.654947 1.083614 0.589382
C  3.118806 -0.241127 0.156622
C  2.205344 0.773303 0.863932
C  4.08602 2.117903 -0.42222
C  4.530454 1.084615 1.822156
C  2.901771 -0.598895 -1.267288
C  1.065483 1.307782 0.098833
C  2.068457 -1.558185 -1.681306
C  -1.301796 1.258508 -0.015325
C  1.222909 -2.369423 -0.746511
C  1.933872 -1.905646 -3.13164
C  -1.532474 0.460114 -1.29336
C  -2.417811 0.847963 0.910367
C  -3.237702 -0.04964 0.343562
C  -2.755814 -0.376226 -1.004316
C  -2.505881 1.421625 2.273922
C  -4.424536 -0.717364 0.9441
C  -4.095193 -1.925268 1.77351
C  -2.882844 -2.362131 2.090863
H  3.373271 -1.078715 0.800448
H  1.958772 0.517574 1.88836
H  3.973198 3.12363 -0.01416
H  5.144258 1.97656 -0.651193
H  3.5423 2.082577 -1.360935
H  4.509075 2.058097 2.316105
H  4.213081 0.336905 2.550535
H  5.567435 0.868963 1.557358
H  3.481582 -0.062287 -2.011993
H  -1.327775 2.337919 -0.189759
H  1.100803 -1.908963 0.232534
H  1.659354 -3.359907 -0.592071
H  0.22726 -2.535257 -1.162804
H  2.597871 -1.314059 -3.761946
H  0.908771 -1.745407 -3.476806
H  2.155367 -2.962189 -3.305765
H  -0.690898 -0.185567 -1.551257
H  -1.716915 1.102862 -2.155602
H  -3.397728 1.095294 2.804911
H  -1.638355 1.136108 2.871631
H  -2.509034 2.512629 2.23114
H  -5.118018 -1.017505 0.153459
H  -4.986788 -0.013147 1.565051
H  -4.9605 -2.467113 2.143426
H  -2.757815 -3.244688 2.704762
H  -1.974982 -1.873313 1.756837
elementType: O C H
totalener: -965.42494849 hartree
nucrepener: 1879.96706740 hartree
electener: -2845.39201588 hartree
oneelecener: -5046.52850636 hartree
twoeener: 2201.13649048 hartree
cpcmener: -0.02990866 hartree
kineticenergy: 961.00667757 hartree
xcener: -95.140798896754 hartree
chargesum: -0.0000000
charge: -0.287276 -0.454215 -0.448483 0.145607 -0.030029 -0.099188 -0.294462 -0.266360 -0.257204 0.349336 -0.016081 0.267198 -0.290433 -0.219868 -0.145825 -0.060125 -0.086626 0.300004 -0.254752 -0.068694 -0.186263 -0.268456 0.110929 0.096782 0.100151 0.096900 0.089983 0.095298 0.085212 0.094854 0.123357 0.108930 0.092794 0.118851 0.093432 0.087904 0.092511 0.098279 0.086908 0.114942 0.099513 0.110373 0.117584 0.091258 0.101716 0.131301 0.129636 0.102797
qa: -0.2873 -0.4542 -0.4485 0.1456 -0.0300 -0.0992 -0.2945 -0.2664 -0.2572 0.3493 -0.0161 0.2672 -0.2904 -0.2199 -0.1458 -0.0601 -0.0866 0.3000 -0.2548 -0.0687 -0.1863 -0.2685 0.1109 0.0968 0.1002 0.0969 0.0900 0.0953 0.0852 0.0949 0.1234 0.1089 0.0928 0.1189 0.0934 0.0879 0.0925 0.0983 0.0869 0.1149 0.0995 0.1104 0.1176 0.0913 0.1017 0.1313 0.1296 0.1028
va: 2.1074 2.0429 2.0553 3.7615 3.8141 3.8206 3.8935 3.8985 3.8365 4.1645 3.6887 3.7409 3.9479 3.9237 3.8900 3.7466 3.4490 4.0453 3.9496 3.8295 3.8464 3.9011 1.0039 1.0276 1.0011 0.9989 1.0175 1.0027 1.0040 1.0024 1.0020 1.0164 1.0048 0.9985 0.9982 1.0079 0.9960 0.9945 1.0278 1.0228 1.0037 1.0029 0.9986 1.0198 1.0000 1.0020 1.0052 1.0216
dispcorr: -0.025848988 hartree
energy: -965.450797475487
dipole: 12.69875 -12.25572 0.44304 -4.43921 5.00737 0.56816 4.92040 -2.81209 2.10831
magnitude: 2.22802 au
magnitude: 5.66316 debye
