program: Orca
programVersion: 5.0.2
elementType: O O O C C C C C C C C C C C C C C C C C C C H H H H H H H H H H H H H H H H H H H H H H H H H H
charge: 0
multiplicity: 1
keywords: wb97x-d3
keywords: def2-TZVPP
keywords: def2/J RIJCOSX
keywords: DEFGRID2
keywords: scfconv7
keywords: smallprint printgap noloewdin
keywords: NOSOSCF
formula: C19H26O3
InChI: InChI=1/C19H26O3/c1-7-8-13-12(4)16(10-15(13)20)22-18(21)17-14(9-11(2)3)19(17,5)6/h7,9,14,16-17H,1,8,10H2,2-6H3
48 atoms
O  0.16821 1.00611 0.411851
O  0.592298 2.262053 2.209698
O  -3.496612 0.425048 -2.215891
C  3.22144 0.99743 0.083492
C  2.817221 -0.320351 0.662931
C  2.343661 0.959947 1.328523
C  2.669042 1.461291 -1.242343
C  4.638786 1.462672 0.318246
C  1.908167 -1.288943 -0.006133
C  0.961719 1.472835 1.370643
C  2.221303 -1.990018 -1.098835
C  -1.182697 1.472013 0.306376
C  3.523533 -1.861025 -1.827857
C  1.267137 -2.985679 -1.684805
C  -1.595261 1.497636 -1.15886
C  -2.123991 0.488901 0.96005
C  -3.055395 0.043495 0.102697
C  -2.822374 0.619161 -1.226982
C  -1.970408 0.111753 2.385972
C  -4.142545 -0.9410 0.363152
C  -3.702261 -2.375007 0.275225
C  -2.465476 -2.808408 0.063383
H  3.594943 -0.80007 1.254445
H  2.863057 1.216196 2.244946
H  2.517053 2.542829 -1.244022
H  3.387945 1.23631 -2.032425
H  1.731011 0.98749 -1.518509
H  5.305235 1.065162 -0.450338
H  4.704812 2.551932 0.279661
H  5.021737 1.141337 1.287641
H  0.951397 -1.484278 0.468253
H  -1.274111 2.455412 0.772343
H  4.207848 -1.15004 -1.368469
H  3.362281 -1.553689 -2.864506
H  4.030845 -2.828682 -1.871855
H  0.33597 -3.046283 -1.121357
H  1.70841 -3.985079 -1.716091
H  1.018454 -2.726913 -2.717564
H  -0.817863 1.086159 -1.806733
H  -1.819508 2.502311 -1.519852
H  -1.930378 0.996688 3.023127
H  -2.782654 -0.525322 2.730285
H  -1.037498 -0.435462 2.544345
H  -4.960684 -0.782456 -0.345436
H  -4.582632 -0.773633 1.350622
H  -4.498651 -3.101801 0.407518
H  -2.251306 -3.868801 0.018287
H  -1.626333 -2.137178 -0.079721
elementType: O C H
totalener: -965.42170854 hartree
nucrepener: 1897.92790750 hartree
electener: -2863.34961604 hartree
oneelecener: -5081.81864944 hartree
twoeener: 2218.46903340 hartree
cpcmener: -0.02992200 hartree
kineticenergy: 960.99138722 hartree
xcener: -95.140438300069 hartree
chargesum: 0.0000000
charge: -0.268303 -0.470532 -0.445646 0.083643 0.000798 -0.104946 -0.288358 -0.272078 -0.259233 0.396965 -0.022347 0.225265 -0.265598 -0.223055 -0.143126 -0.049210 -0.088869 0.291819 -0.249984 -0.061976 -0.197681 -0.230920 0.115547 0.094013 0.114862 0.096225 0.089602 0.090626 0.098792 0.087462 0.107515 0.109187 0.090685 0.099792 0.107065 0.079196 0.099077 0.094988 0.101152 0.104380 0.122034 0.102428 0.112168 0.091337 0.102130 0.129478 0.132657 0.070973
qa: -0.2683 -0.4705 -0.4456 0.0836 0.0008 -0.1049 -0.2884 -0.2721 -0.2592 0.3970 -0.0223 0.2253 -0.2656 -0.2231 -0.1431 -0.0492 -0.0889 0.2918 -0.2500 -0.0620 -0.1977 -0.2309 0.1155 0.0940 0.1149 0.0962 0.0896 0.0906 0.0988 0.0875 0.1075 0.1092 0.0907 0.0998 0.1071 0.0792 0.0991 0.0950 0.1012 0.1044 0.1220 0.1024 0.1122 0.0913 0.1021 0.1295 0.1327 0.0710
va: 2.1105 2.0334 2.0626 3.7035 3.7736 3.8893 3.8972 3.9118 3.8625 4.1418 3.6998 3.7446 3.9367 3.9322 3.8881 3.7237 3.4185 4.0712 3.9435 3.8308 3.8990 3.8778 1.0041 1.0275 1.0011 1.0002 1.0069 1.0034 1.0006 1.0061 1.0050 1.0301 1.0067 0.9966 1.0006 1.0040 0.9982 0.9975 1.0290 1.0221 1.0062 1.0051 0.9966 1.0205 0.9995 1.0022 1.0016 1.0320
dispcorr: -0.027272802 hartree
energy: -965.448981342045
dipole: 15.76000 -14.46360 1.29640 -10.63594 10.07138 -0.56456 -4.15690 4.76357 0.60667
magnitude: 1.53864 au
magnitude: 3.91092 debye
