program: Orca
programVersion: 5.0.2
elementType: O O O C C C C C C C C C C C C C C C C C C C H H H H H H H H H H H H H H H H H H H H H H H H H H
charge: 0
multiplicity: 1
keywords: wb97x-d3
keywords: def2-TZVPP
keywords: def2/J RIJCOSX
keywords: DEFGRID2
keywords: scfconv7
keywords: smallprint printgap noloewdin
keywords: NOSOSCF
formula: C19H26O3
InChI: InChI=1/C19H26O3/c1-7-8-13-12(4)16(10-15(13)20)22-18(21)17-14(9-11(2)3)19(17,5)6/h7,9,14,16-17H,1,8,10H2,2-6H3
48 atoms
O  0.158124 1.013069 0.394071
O  0.595299 2.307836 2.162029
O  -3.508331 0.400483 -2.220619
C  3.233624 0.990807 0.103117
C  2.787164 -0.32808 0.648056
C  2.326822 0.948071 1.327338
C  2.716423 1.49931 -1.220183
C  4.659904 1.406177 0.37361
C  1.8815 -1.274593 -0.056155
C  0.955281 1.492262 1.344294
C  2.206318 -1.952988 -1.159651
C  -1.193967 1.475118 0.289208
C  3.514319 -1.805543 -1.87472
C  1.262021 -2.944109 -1.770126
C  -1.614286 1.49496 -1.173591
C  -2.127703 0.490374 0.950601
C  -3.059525 0.034364 0.099393
C  -2.833611 0.604319 -1.234149
C  -1.967743 0.126257 2.378848
C  -4.149948 -0.942203 0.378824
C  -3.713816 -2.37958 0.37534
C  -2.478963 -2.832045 0.195286
H  3.543208 -0.833002 1.246742
H  2.828986 1.177968 2.260278
H  2.600325 2.585037 -1.199392
H  3.437673 1.268693 -2.006332
H  1.766686 1.063286 -1.517525
H  5.32889 0.984935 -0.380516
H  4.768715 2.492226 0.340648
H  5.008031 1.066848 1.350156
H  0.921171 -1.481377 0.405273
H  -1.288646 2.458921 0.75362
H  4.19857 -1.114816 -1.385494
H  3.36213 -1.459984 -2.900686
H  4.017493 -2.773371 -1.950126
H  1.708344 -3.941607 -1.804827
H  1.026103 -2.676769 -2.80374
H  0.3234 -3.015245 -1.219669
H  -0.836115 1.093912 -1.826789
H  -1.853077 2.497153 -1.53233
H  -2.773908 -0.514186 2.731599
H  -1.029411 -0.411085 2.539326
H  -1.932229 1.017662 3.007728
H  -4.950236 -0.81962 -0.357201
H  -4.615475 -0.725147 1.34522
H  -4.515223 -3.092929 0.544329
H  -2.270847 -3.894455 0.211098
H  -1.63503 -2.175614 0.01742
elementType: O C H
totalener: -965.42170760 hartree
nucrepener: 1896.49343013 hartree
electener: -2861.91513773 hartree
oneelecener: -5078.95062542 hartree
twoeener: 2217.03548769 hartree
cpcmener: -0.02980129 hartree
kineticenergy: 960.98667485 hartree
xcener: -95.139405488978 hartree
chargesum: -0.0000000
charge: -0.268384 -0.469387 -0.445814 0.081994 0.004005 -0.102939 -0.286999 -0.272910 -0.263914 0.395210 -0.019594 0.225263 -0.267332 -0.225074 -0.143860 -0.055504 -0.079808 0.292381 -0.249633 -0.064651 -0.191385 -0.239115 0.115075 0.094739 0.114560 0.095323 0.090434 0.090908 0.098437 0.087081 0.109149 0.109433 0.091412 0.100543 0.106565 0.098377 0.094642 0.081007 0.100431 0.104546 0.102226 0.112481 0.122503 0.090623 0.102737 0.129860 0.132882 0.071474
qa: -0.2684 -0.4694 -0.4458 0.0820 0.0040 -0.1029 -0.2870 -0.2729 -0.2639 0.3952 -0.0196 0.2253 -0.2673 -0.2251 -0.1439 -0.0555 -0.0798 0.2924 -0.2496 -0.0647 -0.1914 -0.2391 0.1151 0.0947 0.1146 0.0953 0.0904 0.0909 0.0984 0.0871 0.1091 0.1094 0.0914 0.1005 0.1066 0.0984 0.0946 0.0810 0.1004 0.1045 0.1022 0.1125 0.1225 0.0906 0.1027 0.1299 0.1329 0.0715
va: 2.1103 2.0348 2.0629 3.7117 3.7656 3.8825 3.8973 3.9121 3.8673 4.1426 3.6969 3.7420 3.9366 3.9332 3.8902 3.7290 3.4041 4.0685 3.9422 3.8300 3.8956 3.8861 1.0041 1.0270 1.0010 1.0000 1.0074 1.0031 1.0008 1.0061 1.0029 1.0306 1.0067 0.9963 1.0009 0.9978 0.9974 1.0034 1.0293 1.0220 1.0050 0.9964 1.0063 1.0214 0.9988 1.0018 1.0019 1.0312
dispcorr: -0.027188623 hartree
energy: -965.448896222850
dipole: 15.87164 -14.58498 1.28666 -10.58828 10.02285 -0.56543 -3.94411 4.58583 0.64172
magnitude: 1.54499 au
magnitude: 3.92706 debye
