program: Orca
programVersion: 5.0.2
elementType: O O O C C C C C C C C C C C C C C C C C C C H H H H H H H H H H H H H H H H H H H H H H H H H H
charge: 0
multiplicity: 1
keywords: wb97x-d3
keywords: def2-TZVPP
keywords: def2/J RIJCOSX
keywords: DEFGRID2
keywords: scfconv7
keywords: smallprint printgap noloewdin
keywords: NOSOSCF
formula: C19H26O3
InChI: InChI=1/C19H26O3/c1-7-8-13-12(4)16(10-15(13)20)22-18(21)17-14(9-11(2)3)19(17,5)6/h7,9,14,16-17H,1,8,10H2,2-6H3
48 atoms
O  0.335121 0.541998 0.364574
O  0.774861 1.808127 2.142403
O  -3.902438 2.049276 -0.68931
C  3.007037 1.416471 -0.785051
C  3.311269 0.188897 0.002516
C  2.54253 1.33967 0.659978
C  2.036974 1.37616 -1.940924
C  4.137669 2.391734 -1.020517
C  2.716639 -1.136818 -0.291063
C  1.150289 1.258086 1.130582
C  2.699997 -2.14814 0.581368
C  -1.039707 0.461707 0.750509
C  3.215055 -1.996908 1.984732
C  2.180731 -3.501278 0.207367
C  -1.822731 1.750406 0.52336
C  -1.694739 -0.55605 -0.146795
C  -2.792128 -0.067144 -0.744127
C  -2.979235 1.336286 -0.35766
C  -1.160404 -1.934971 -0.241266
C  -3.739202 -0.793889 -1.636702
C  -4.691084 -1.718711 -0.933158
C  -4.745594 -1.966221 0.369653
H  4.325649 0.134124 0.391575
H  3.134301 1.928819 1.350987
H  2.589416 1.196315 -2.865639
H  1.276055 0.604823 -1.867159
H  1.525827 2.334651 -2.050107
H  4.699509 2.121617 -1.917137
H  3.755939 3.405112 -1.162008
H  4.838474 2.414036 -0.1849
H  2.330718 -1.304187 -1.29215
H  -1.102656 0.128811 1.791184
H  2.882373 -2.816294 2.622791
H  2.885547 -1.063861 2.44595
H  4.308471 -1.997062 2.01267
H  1.332069 -3.787009 0.834693
H  2.945578 -4.268069 0.360446
H  1.863448 -3.549657 -0.834489
H  -1.227352 2.505144 0.003333
H  -2.183728 2.202373 1.447378
H  -1.730326 -2.553526 -0.931868
H  -0.118705 -1.931551 -0.565664
H  -1.18144 -2.415636 0.740467
H  -3.183138 -1.375862 -2.378556
H  -4.32108 -0.073519 -2.219096
H  -5.389531 -2.226961 -1.591496
H  -5.475304 -2.65833 0.770644
H  -4.085415 -1.492471 1.086498
elementType: O C H
totalener: -965.42247962 hartree
nucrepener: 1879.07774144 hartree
electener: -2844.50022106 hartree
oneelecener: -5043.98570197 hartree
twoeener: 2199.48548091 hartree
cpcmener: -0.03089657 hartree
kineticenergy: 960.99018884 hartree
xcener: -95.139707623278 hartree
chargesum: -0.0000000
charge: -0.274855 -0.474286 -0.447068 0.137928 -0.034463 -0.124011 -0.291163 -0.265975 -0.255342 0.400689 -0.010987 0.240811 -0.278429 -0.255094 -0.141942 -0.072478 -0.057827 0.306079 -0.267742 -0.078525 -0.186168 -0.275332 0.112696 0.091772 0.099574 0.084092 0.103990 0.093321 0.096559 0.086696 0.127513 0.106919 0.095591 0.097897 0.105959 0.096095 0.113592 0.091730 0.104218 0.102043 0.105050 0.104276 0.120444 0.104549 0.090026 0.130208 0.129904 0.111467
qa: -0.2749 -0.4743 -0.4471 0.1379 -0.0345 -0.1240 -0.2912 -0.2660 -0.2553 0.4007 -0.0110 0.2408 -0.2784 -0.2551 -0.1419 -0.0725 -0.0578 0.3061 -0.2677 -0.0785 -0.1862 -0.2753 0.1127 0.0918 0.0996 0.0841 0.1040 0.0933 0.0966 0.0867 0.1275 0.1069 0.0956 0.0979 0.1060 0.0961 0.1136 0.0917 0.1042 0.1020 0.1050 0.1043 0.1204 0.1045 0.0900 0.1302 0.1299 0.1115
va: 2.1104 2.0335 2.0629 3.7417 3.7918 3.8835 3.9101 3.9019 3.7882 4.1174 3.6538 3.7612 3.9515 3.9257 3.8941 3.7298 3.4100 4.0677 3.9464 3.8360 3.8345 3.9069 1.0022 1.0302 1.0006 1.0090 1.0004 1.0023 1.0014 1.0058 0.9973 1.0187 1.0048 0.9997 0.9964 0.9915 0.9965 1.0036 1.0214 1.0253 1.0087 1.0057 0.9927 0.9985 1.0232 1.0031 1.0048 1.0139
dispcorr: -0.026368279 hartree
energy: -965.448847902408
dipole: 13.89346 -12.01392 1.87954 -13.90365 11.74010 -2.16354 -3.91970 3.25397 -0.66573
magnitude: 2.94224 au
magnitude: 7.47858 debye
