program: Orca
programVersion: 5.0.2
elementType: O O O C C C C C C C C C C C C C C C C C C C H H H H H H H H H H H H H H H H H H H H H H H H H H
charge: 0
multiplicity: 1
keywords: wb97x-d3
keywords: def2-TZVPP
keywords: def2/J RIJCOSX
keywords: DEFGRID2
keywords: scfconv7
keywords: smallprint printgap noloewdin
keywords: NOSOSCF
formula: C19H26O3
InChI: InChI=1/C19H26O3/c1-7-8-13-12(4)16(10-15(13)20)22-18(21)17-14(9-11(2)3)19(17,5)6/h7,9,14,16-17H,1,8,10H2,2-6H3
48 atoms
O  0.081165 0.930867 0.661265
O  1.017672 2.17444 -0.935012
O  -2.418575 -1.976863 -1.512366
C  3.753354 1.420007 0.310714
C  3.187795 0.03038 0.32512
C  2.35894 1.215995 0.827573
C  4.043522 2.121882 -0.994603
C  4.780082 1.734821 1.375215
C  2.795691 -0.683252 -0.916757
C  1.123361 1.523772 0.074769
C  1.978458 -1.740367 -0.960319
C  -1.1935 1.018828 0.010304
C  1.319274 -2.33118 0.248184
C  1.668277 -2.432937 -2.251843
C  -1.279955 0.148011 -1.237971
C  -2.183446 0.413687 0.974747
C  -2.712795 -0.724477 0.502857
C  -2.175495 -0.999004 -0.83733
C  -2.472039 1.085618 2.263583
C  -3.715829 -1.614978 1.150071
C  -5.144079 -1.223063 0.903658
C  -5.568992 -0.132982 0.277182
H  3.542562 -0.609671 1.12773
H  2.225313 1.25318 1.904278
H  5.059945 1.88187 -1.313918
H  3.375622 1.853053 -1.807795
H  3.98909 3.204736 -0.87013
H  4.809572 2.805822 1.586448
H  4.568039 1.218547 2.31295
H  5.778192 1.433446 1.050985
H  3.226913 -0.333009 -1.849708
H  -1.430085 2.067353 -0.188781
H  1.413652 -1.714619 1.139935
H  1.746465 -3.312002 0.475823
H  0.255243 -2.498914 0.066116
H  1.982077 -3.480088 -2.220472
H  2.159785 -1.961087 -3.102649
H  0.591403 -2.441549 -2.442679
H  -0.31442 -0.212183 -1.595875
H  -1.744372 0.689435 -2.065267
H  -3.165024 0.520304 2.883848
H  -1.556774 1.253052 2.835105
H  -2.908601 2.070756 2.080197
H  -3.548368 -1.659325 2.23053
H  -3.571969 -2.640504 0.796835
H  -5.877342 -1.919521 1.299024
H  -6.627715 0.059161 0.15841
H  -4.89433 0.603233 -0.143528
elementType: O C H
totalener: -965.42348700 hartree
nucrepener: 1890.22371051 hartree
electener: -2855.64719751 hartree
oneelecener: -5067.02712445 hartree
twoeener: 2211.37992694 hartree
cpcmener: -0.02928751 hartree
kineticenergy: 960.99342352 hartree
xcener: -95.138308267365 hartree
chargesum: -0.0000000
charge: -0.277570 -0.442801 -0.451016 0.140716 -0.034176 -0.118240 -0.289694 -0.269834 -0.210236 0.351828 -0.063151 0.270836 -0.279638 -0.216666 -0.163543 -0.048730 -0.080605 0.298342 -0.239001 -0.101324 -0.181229 -0.275234 0.105437 0.100694 0.096280 0.084508 0.100402 0.095389 0.085453 0.094354 0.124141 0.108015 0.090467 0.115769 0.092225 0.102950 0.090125 0.081048 0.104416 0.118407 0.097800 0.112416 0.112312 0.103068 0.093072 0.130606 0.130639 0.110973
qa: -0.2776 -0.4428 -0.4510 0.1407 -0.0342 -0.1182 -0.2897 -0.2698 -0.2102 0.3518 -0.0632 0.2708 -0.2796 -0.2167 -0.1635 -0.0487 -0.0806 0.2983 -0.2390 -0.1013 -0.1812 -0.2752 0.1054 0.1007 0.0963 0.0845 0.1004 0.0954 0.0855 0.0944 0.1241 0.1080 0.0905 0.1158 0.0922 0.1030 0.0901 0.0810 0.1044 0.1184 0.0978 0.1124 0.1123 0.1031 0.0931 0.1306 0.1306 0.1110
va: 2.1154 2.0564 2.0376 3.7645 3.8046 3.8324 3.9009 3.8975 3.7987 4.1889 3.7304 3.7179 3.9467 3.9089 3.8862 3.7732 3.4868 3.9821 3.9354 3.8413 3.8283 3.9089 1.0033 1.0264 0.9996 1.0142 1.0022 1.0025 1.0036 1.0025 1.0003 1.0199 1.0102 1.0005 0.9977 0.9963 1.0071 1.0105 1.0254 1.0195 1.0041 1.0062 0.9967 1.0001 1.0191 1.0030 1.0042 1.0140
dispcorr: -0.026920445 hartree
energy: -965.450407449298
dipole: 8.92383 -8.66772 0.25610 -1.90817 2.48921 0.58103 4.02229 -1.85998 2.16230
magnitude: 2.25361 au
magnitude: 5.72822 debye
