program: Orca
programVersion: 5.0.2
elementType: O O O C C C C C C C C C C C C C C C C C C C H H H H H H H H H H H H H H H H H H H H H H H H H H
charge: 0
multiplicity: 1
keywords: wb97x-d3
keywords: def2-TZVPP
keywords: def2/J RIJCOSX
keywords: DEFGRID2
keywords: scfconv7
keywords: smallprint printgap noloewdin
keywords: NOSOSCF
formula: C19H26O3
InChI: InChI=1/C19H26O3/c1-7-8-13-12(4)16(10-15(13)20)22-18(21)17-14(9-11(2)3)19(17,5)6/h7,9,14,16-17H,1,8,10H2,2-6H3
48 atoms
O  0.360957 0.953177 0.322162
O  0.498607 2.18159 2.184598
O  -3.29602 0.019035 -2.332064
C  3.370938 1.205432 0.104656
C  3.105739 -0.070937 0.836087
C  2.474323 1.221196 1.33497
C  2.825283 1.453742 -1.280132
C  4.723732 1.845976 0.314475
C  2.301084 -1.204993 0.310832
C  1.027125 1.506036 1.330463
C  2.658055 -1.999313 -0.701102
C  -1.05168 1.139587 0.206419
C  3.912111 -1.822543 -1.499787
C  1.799038 -3.155996 -1.114948
C  -1.450853 1.174779 -1.261591
C  -1.802174 -0.035405 0.787707
C  -2.682644 -0.541299 -0.090904
C  -2.588101 0.18777 -1.362227
C  -1.574988 -0.462842 2.18925
C  -3.701608 -1.6159 0.115495
C  -5.014424 -1.011526 0.522361
C  -6.107938 -1.00009 -0.229093
H  3.920415 -0.384373 1.486104
H  2.935214 1.641833 2.22105
H  3.60589 1.249643 -2.015395
H  1.970429 0.83599 -1.539232
H  2.536924 2.499921 -1.402492
H  4.677996 2.924006 0.146698
H  5.101513 1.681939 1.324453
H  5.454918 1.433467 -0.384406
H  1.386512 -1.446675 0.844264
H  -1.349462 2.056564 0.720072
H  3.6823 -1.641568 -2.553348
H  4.514205 -2.735243 -1.470602
H  4.536822 -1.004198 -1.146054
H  0.894725 -3.233765 -0.510811
H  2.342445 -4.101333 -1.032922
H  1.49693 -3.064135 -2.162032
H  -0.633306 0.838496 -1.904356
H  -1.751795 2.164481 -1.60577
H  -0.539511 -0.775013 2.34457
H  -1.760689 0.364078 2.877792
H  -2.216494 -1.293753 2.476138
H  -3.361248 -2.312943 0.884605
H  -3.823282 -2.191591 -0.804584
H  -5.031699 -0.536159 1.499222
H  -7.023483 -0.536067 0.115471
H  -6.132237 -1.455727 -1.212309
elementType: O C H
totalener: -965.42199776 hartree
nucrepener: 1865.44364014 hartree
electener: -2830.86563790 hartree
oneelecener: -5016.84189679 hartree
twoeener: 2185.97625889 hartree
cpcmener: -0.03071318 hartree
kineticenergy: 960.99087960 hartree
xcener: -95.138260081967 hartree
chargesum: -0.0000000
charge: -0.262862 -0.470604 -0.447865 0.082166 -0.000913 -0.096660 -0.285472 -0.272086 -0.273150 0.386950 -0.010922 0.209811 -0.263612 -0.233265 -0.134175 -0.027910 -0.075446 0.287268 -0.250488 -0.109569 -0.177449 -0.276182 0.114226 0.091933 0.095678 0.089406 0.114857 0.098867 0.087953 0.090937 0.112522 0.109140 0.100574 0.106449 0.090817 0.087241 0.096258 0.094392 0.102836 0.099022 0.111401 0.118872 0.102823 0.109944 0.095690 0.140334 0.128461 0.111802
qa: -0.2629 -0.4706 -0.4479 0.0822 -0.0009 -0.0967 -0.2855 -0.2721 -0.2732 0.3870 -0.0109 0.2098 -0.2636 -0.2333 -0.1342 -0.0279 -0.0754 0.2873 -0.2505 -0.1096 -0.1774 -0.2762 0.1142 0.0919 0.0957 0.0894 0.1149 0.0989 0.0880 0.0909 0.1125 0.1091 0.1006 0.1064 0.0908 0.0872 0.0963 0.0944 0.1028 0.0990 0.1114 0.1189 0.1028 0.1099 0.0957 0.1403 0.1285 0.1118
va: 2.1022 2.0323 2.0539 3.6982 3.7645 3.8739 3.8878 3.9111 3.8779 4.1536 3.6857 3.7687 3.9336 3.9290 3.9212 3.7275 3.4239 4.0862 3.9438 3.8697 3.7877 3.9561 1.0047 1.0272 0.9998 1.0080 1.0013 1.0007 1.0059 1.0036 1.0067 1.0312 0.9959 1.0006 1.0058 1.0071 0.9972 0.9965 1.0257 1.0249 0.9980 1.0029 1.0055 1.0043 1.0214 1.0004 1.0030 1.0138
dispcorr: -0.025727876 hartree
energy: -965.447725637256
dipole: 14.17898 -12.41380 1.76518 -8.66759 7.95944 -0.70815 -3.12324 3.72496 0.60172
magnitude: 1.99485 au
magnitude: 5.07049 debye
