program: Orca
programVersion: 5.0.2
elementType: O O O C C C C C C C C C C C C C C C C C C C H H H H H H H H H H H H H H H H H H H H H H H H H H
charge: 0
multiplicity: 1
keywords: wb97x-d3
keywords: def2-TZVPP
keywords: def2/J RIJCOSX
keywords: DEFGRID2
keywords: scfconv7
keywords: smallprint printgap noloewdin
keywords: NOSOSCF
formula: C19H26O3
InChI: InChI=1/C19H26O3/c1-7-8-13-12(4)16(10-15(13)20)22-18(21)17-14(9-11(2)3)19(17,5)6/h7,9,14,16-17H,1,8,10H2,2-6H3
48 atoms
O  0.258048 0.756031 0.569992
O  0.542267 2.526456 1.889512
O  -3.918541 1.910726 -1.181068
C  3.084691 1.180952 -0.415939
C  3.223024 0.255551 0.750009
C  2.458885 1.559892 0.918831
C  2.24254 0.814558 -1.613852
C  4.296995 2.003245 -0.788487
C  2.565304 -1.072659 0.866245
C  1.011455 1.666748 1.178001
C  2.874152 -2.148112 0.137326
C  -1.153436 0.809925 0.783738
C  3.901148 -2.148049 -0.951607
C  2.195819 -3.464425 0.367521
C  -1.854436 1.974656 0.094403
C  -1.760972 -0.42514 0.172963
C  -2.823151 -0.129672 -0.59263
C  -3.004083 1.325768 -0.64025
C  -1.217615 -1.76967 0.480875
C  -3.761894 -1.079454 -1.26924
C  -4.759983 -1.641717 -0.300393
C  -4.94509 -2.936878 -0.076615
H  4.193437 0.301226 1.240481
H  2.991063 2.330842 1.463871
H  2.894069 0.453128 -2.411652
H  1.511139 0.03632 -1.41891
H  1.714358 1.687562 -2.002882
H  4.005353 2.923014 -1.299757
H  4.887314 2.282591 0.085314
H  4.947753 1.442767 -1.463401
H  1.828133 -1.185522 1.655513
H  -1.352643 0.808007 1.860277
H  4.661992 -2.908922 -0.757381
H  4.410299 -1.192538 -1.063964
H  3.450207 -2.405759 -1.913566
H  1.465813 -3.419215 1.175717
H  2.921987 -4.243431 0.614525
H  1.67951 -3.801838 -0.535465
H  -1.19895 2.45502 -0.637557
H  -2.203563 2.746752 0.779122
H  -0.278934 -1.934276 -0.052653
H  -0.998733 -1.868899 1.545552
H  -1.904688 -2.564246 0.196448
H  -3.209179 -1.889257 -1.749827
H  -4.291469 -0.544682 -2.063225
H  -5.356679 -0.915185 0.243833
H  -5.687069 -3.288015 0.629504
H  -4.378149 -3.695779 -0.60415
elementType: O C H
totalener: -965.42288723 hartree
nucrepener: 1864.47765935 hartree
electener: -2829.90054658 hartree
oneelecener: -5014.59654655 hartree
twoeener: 2184.69599998 hartree
cpcmener: -0.02975768 hartree
kineticenergy: 960.99565332 hartree
xcener: -95.139683372621 hartree
chargesum: 0.0000000
charge: -0.277573 -0.470257 -0.450764 0.090475 0.004264 -0.095408 -0.294068 -0.272890 -0.279955 0.395885 -0.004295 0.211066 -0.264009 -0.258779 -0.133422 -0.026940 -0.060263 0.297191 -0.293277 -0.095355 -0.179310 -0.283737 0.114401 0.092036 0.095677 0.095448 0.113949 0.099715 0.087540 0.090131 0.114468 0.109481 0.106821 0.091153 0.100388 0.090768 0.109059 0.099380 0.106477 0.099590 0.115573 0.119448 0.104630 0.103897 0.096002 0.143302 0.129083 0.113007
qa: -0.2776 -0.4703 -0.4508 0.0905 0.0043 -0.0954 -0.2941 -0.2729 -0.2800 0.3959 -0.0043 0.2111 -0.2640 -0.2588 -0.1334 -0.0269 -0.0603 0.2972 -0.2933 -0.0954 -0.1793 -0.2837 0.1144 0.0920 0.0957 0.0954 0.1139 0.0997 0.0875 0.0901 0.1145 0.1095 0.1068 0.0912 0.1004 0.0908 0.1091 0.0994 0.1065 0.0996 0.1156 0.1194 0.1046 0.1039 0.0960 0.1433 0.1291 0.1130
va: 2.1127 2.0403 2.0531 3.6782 3.7804 3.8805 3.8951 3.9126 3.8722 4.1348 3.6482 3.7866 3.9384 3.9328 3.9068 3.7109 3.4274 4.0804 3.9616 3.8544 3.7973 3.9427 1.0043 1.0280 0.9997 1.0045 1.0019 1.0003 1.0060 1.0036 1.0117 1.0151 1.0009 1.0054 0.9965 1.0030 0.9999 0.9926 1.0185 1.0283 0.9922 0.9973 1.0128 1.0046 1.0242 1.0035 1.0041 1.0094
dispcorr: -0.026402580 hartree
energy: -965.449289807499
dipole: 15.79690 -13.74960 2.04730 -17.32183 15.05059 -2.27124 -6.31644 6.13876 -0.17768
magnitude: 3.06292 au
magnitude: 7.78534 debye
