program: Orca
programVersion: 5.0.2
elementType: O O O C C C C C C C C C C C C C C C C C C C H H H H H H H H H H H H H H H H H H H H H H H H H H
charge: 0
multiplicity: 1
keywords: wb97x-d3
keywords: def2-TZVPP
keywords: def2/J RIJCOSX
keywords: DEFGRID2
keywords: scfconv7
keywords: smallprint printgap noloewdin
keywords: NOSOSCF
formula: C19H26O3
InChI: InChI=1/C19H26O3/c1-7-8-13-12(4)16(10-15(13)20)22-18(21)17-14(9-11(2)3)19(17,5)6/h7,9,14,16-17H,1,8,10H2,2-6H3
48 atoms
O  0.215082 0.858223 0.822473
O  0.709252 2.940411 1.437692
O  -3.759773 1.495933 -1.424223
C  2.933464 0.976614 -0.609555
C  3.121558 0.187165 0.645733
C  2.47739 1.558877 0.723865
C  1.932651 0.551876 -1.656132
C  4.152214 1.641083 -1.204405
C  2.406822 -1.074422 0.974706
C  1.067226 1.856883 1.033632
C  2.579834 -2.237377 0.341761
C  -1.176689 1.126089 1.020467
C  3.489704 -2.422492 -0.832997
C  1.858693 -3.475616 0.781675
C  -1.799682 1.979899 -0.078286
C  -1.902701 -0.191653 0.955578
C  -2.918808 -0.158861 0.079845
C  -2.947358 1.144568 -0.595767
C  -1.487209 -1.324783 1.81735
C  -3.886502 -1.244232 -0.264907
C  -3.349318 -2.091089 -1.381852
C  -3.874649 -2.161382 -2.598379
H  4.138647 0.21429 1.032564
H  3.116736 2.345255 1.108365
H  1.498173 1.423807 -2.150277
H  2.439548 -0.03101 -2.42725
H  1.120388 -0.058886 -1.272276
H  3.876012 2.530363 -1.774899
H  4.866265 1.946734 -0.438456
H  4.667372 0.959034 -1.884773
H  1.752908 -1.057337 1.840906
H  -1.3204 1.571138 2.009709
H  4.026511 -1.517023 -1.110284
H  2.9345 -2.769164 -1.708607
H  4.233273 -3.195122 -0.618198
H  1.247873 -3.305991 1.668444
H  2.561474 -4.281944 1.007649
H  1.205127 -3.849839 -0.011362
H  -1.098601 2.169903 -0.894832
H  -2.153687 2.948078 0.276655
H  -0.61009 -1.822838 1.396855
H  -1.208763 -0.981971 2.81523
H  -2.270995 -2.074719 1.914893
H  -4.843772 -0.805369 -0.554584
H  -4.073291 -1.868799 0.61294
H  -2.453454 -2.66201 -1.151974
H  -3.440157 -2.792916 -3.363458
H  -4.766914 -1.608823 -2.87066
elementType: O C H
totalener: -965.42289287 hartree
nucrepener: 1880.28731172 hartree
electener: -2845.71020458 hartree
oneelecener: -5046.43086843 hartree
twoeener: 2200.72066385 hartree
cpcmener: -0.03137712 hartree
kineticenergy: 960.99313084 hartree
xcener: -95.137994671864 hartree
chargesum: 0.0000000
charge: -0.275552 -0.468624 -0.446091 0.089044 -0.002264 -0.084460 -0.299892 -0.271885 -0.286134 0.383963 0.001570 0.222530 -0.267906 -0.248635 -0.136659 -0.026362 -0.061930 0.285431 -0.294795 -0.099849 -0.182421 -0.273783 0.115652 0.093798 0.114019 0.097451 0.096338 0.099214 0.087357 0.090705 0.118768 0.109491 0.091370 0.100613 0.106663 0.087865 0.106074 0.099543 0.104214 0.106024 0.105017 0.119636 0.110823 0.090167 0.112191 0.140346 0.128441 0.112923
qa: -0.2756 -0.4686 -0.4461 0.0890 -0.0023 -0.0845 -0.2999 -0.2719 -0.2861 0.3840 0.0016 0.2225 -0.2679 -0.2486 -0.1367 -0.0264 -0.0619 0.2854 -0.2948 -0.0998 -0.1824 -0.2738 0.1157 0.0938 0.1140 0.0975 0.0963 0.0992 0.0874 0.0907 0.1188 0.1095 0.0914 0.1006 0.1067 0.0879 0.1061 0.0995 0.1042 0.1060 0.1050 0.1196 0.1108 0.0902 0.1122 0.1403 0.1284 0.1129
va: 2.1085 2.0382 2.0579 3.6936 3.7781 3.8677 3.8915 3.9112 3.8785 4.1490 3.6508 3.7707 3.9427 3.9278 3.8877 3.7156 3.4344 4.0900 3.9609 3.8519 3.7925 3.9495 1.0036 1.0278 1.0003 1.0011 1.0107 1.0009 1.0060 1.0035 1.0101 1.0173 1.0056 0.9961 1.0009 1.0039 0.9986 0.9953 1.0222 1.0245 0.9937 0.9993 1.0078 1.0256 1.0061 1.0003 1.0030 1.0125
dispcorr: -0.026338635 hartree
energy: -965.449231501049
dipole: 14.25775 -12.61794 1.63981 -17.47929 15.33115 -2.14814 -5.85520 6.66833 0.81313
magnitude: 2.82217 au
magnitude: 7.17339 debye
