program: Orca
programVersion: 5.0.2
elementType: O O O C C C C C C C C C C C C C C C C C C C H H H H H H H H H H H H H H H H H H H H H H H H H H
charge: 0
multiplicity: 1
keywords: wb97x-d3
keywords: def2-TZVPP
keywords: def2/J RIJCOSX
keywords: DEFGRID2
keywords: scfconv7
keywords: smallprint printgap noloewdin
keywords: NOSOSCF
formula: C19H26O3
InChI: InChI=1/C19H26O3/c1-7-8-13-12(4)16(10-15(13)20)22-18(21)17-14(9-11(2)3)19(17,5)6/h7,9,14,16-17H,1,8,10H2,2-6H3
48 atoms
O  0.296409 0.703374 0.528486
O  0.517299 2.541918 1.764366
O  -3.951172 1.629329 -1.194008
C  3.112328 1.144749 -0.464422
C  3.276664 0.312678 0.766238
C  2.466715 1.59879 0.836465
C  2.291321 0.66118 -1.635311
C  4.297686 1.979368 -0.892622
C  2.664549 -1.025911 0.975987
C  1.016365 1.667776 1.091754
C  3.026415 -2.140678 0.335844
C  -1.113883 0.703862 0.758205
C  4.071193 -2.18172 -0.735464
C  2.396568 -3.462096 0.656591
C  -1.87368 1.818206 0.047805
C  -1.675558 -0.57432 0.190401
C  -2.761481 -0.344564 -0.564205
C  -3.006521 1.100591 -0.647905
C  -1.070913 -1.882765 0.538372
C  -3.692574 -1.333027 -1.189967
C  -4.826183 -1.644155 -0.256142
C  -6.094547 -1.317792 -0.468095
H  4.241729 0.427311 1.25591
H  2.969306 2.424487 1.326634
H  2.960833 0.270472 -2.404022
H  1.590857 -0.130485 -1.387091
H  1.730192 1.482009 -2.086798
H  3.977448 2.847739 -1.472283
H  4.873119 2.343801 -0.040417
H  4.97186 1.39317 -1.521142
H  1.918088 -1.106804 1.76051
H  -1.299316 0.724615 1.837231
H  4.859911 -2.891486 -0.471364
H  4.541523 -1.216593 -0.915543
H  3.647501 -2.5324 -1.680281
H  1.909032 -3.887905 -0.2247
H  1.652228 -3.386163 1.449292
H  3.149201 -4.189731 0.972048
H  -1.250822 2.304388 -0.708325
H  -2.245297 2.593999 0.716307
H  -1.683042 -2.721026 0.211174
H  -0.086364 -1.988456 0.077931
H  -0.925485 -1.966583 1.617533
H  -3.153957 -2.2513 -1.435243
H  -4.08092 -0.932061 -2.128542
H  -4.552685 -2.158015 0.661354
H  -6.86587 -1.561414 0.251756
H  -6.410806 -0.79581 -1.363892
elementType: O C H
totalener: -965.42290391 hartree
nucrepener: 1860.75199416 hartree
electener: -2826.17489807 hartree
oneelecener: -5007.27296594 hartree
twoeener: 2181.09806787 hartree
cpcmener: -0.03161393 hartree
kineticenergy: 960.99571779 hartree
xcener: -95.139488109367 hartree
chargesum: 0.0000000
charge: -0.277254 -0.470481 -0.447399 0.093434 0.004187 -0.097380 -0.291416 -0.273203 -0.279690 0.396272 -0.004858 0.210120 -0.264613 -0.256963 -0.131377 -0.010630 -0.058690 0.279785 -0.292911 -0.104137 -0.179934 -0.274982 0.113951 0.091415 0.095318 0.094139 0.113671 0.099736 0.087645 0.089901 0.114110 0.109247 0.106416 0.091388 0.100770 0.099194 0.090090 0.108519 0.106775 0.099590 0.108579 0.109732 0.119128 0.108744 0.093635 0.140021 0.128180 0.112225
qa: -0.2773 -0.4705 -0.4474 0.0934 0.0042 -0.0974 -0.2914 -0.2732 -0.2797 0.3963 -0.0049 0.2101 -0.2646 -0.2570 -0.1314 -0.0106 -0.0587 0.2798 -0.2929 -0.1041 -0.1799 -0.2750 0.1140 0.0914 0.0953 0.0941 0.1137 0.0997 0.0876 0.0899 0.1141 0.1092 0.1064 0.0914 0.1008 0.0992 0.0901 0.1085 0.1068 0.0996 0.1086 0.1097 0.1191 0.1087 0.0936 0.1400 0.1282 0.1122
va: 2.1154 2.0404 2.0543 3.6772 3.7807 3.8854 3.8968 3.9126 3.8723 4.1345 3.6486 3.7957 3.9381 3.9325 3.9036 3.7016 3.4412 4.0942 3.9642 3.8638 3.7913 3.9583 1.0047 1.0282 0.9998 1.0037 1.0020 1.0003 1.0061 1.0036 1.0117 1.0146 1.0011 1.0054 0.9962 0.9927 1.0034 0.9999 1.0191 1.0288 1.0085 0.9916 0.9955 1.0041 1.0222 1.0003 1.0029 1.0131
dispcorr: -0.026307531 hartree
energy: -965.449211438798
dipole: 15.66208 -13.44737 2.21471 -15.93717 13.59013 -2.34703 -5.65222 5.61726 -0.03496
magnitude: 3.22718 au
magnitude: 8.20285 debye
