program: Orca
programVersion: 5.0.2
elementType: O O O C C C C C C C C C C C C C C C C C C C H H H H H H H H H H H H H H H H H H H H H H H H H H
charge: 0
multiplicity: 1
keywords: wb97x-d3
keywords: def2-TZVPP
keywords: def2/J RIJCOSX
keywords: DEFGRID2
keywords: scfconv7
keywords: smallprint printgap noloewdin
keywords: NOSOSCF
formula: C19H26O3
InChI: InChI=1/C19H26O3/c1-7-8-13-12(4)16(10-15(13)20)22-18(21)17-14(9-11(2)3)19(17,5)6/h7,9,14,16-17H,1,8,10H2,2-6H3
48 atoms
O  -0.283164 0.562944 0.565944
O  0.716204 -1.341146 -0.053008
O  -4.729249 1.252159 1.636747
C  3.051467 0.563225 -0.875974
C  3.388934 0.167252 0.527437
C  1.987507 0.684372 0.202103
C  2.952377 -0.47686 -1.96325
C  3.600421 1.878932 -1.374509
C  3.656158 -1.226642 0.93267
C  0.783665 -0.164873 0.214821
C  4.693013 -1.641949 1.669505
C  -1.578356 -0.043545 0.58085
C  5.773852 -0.762904 2.220624
C  4.845754 -3.094259 2.011955
C  -2.416571 0.517954 1.719565
C  -2.337569 0.311214 -0.674658
C  -3.540476 0.838005 -0.394966
C  -3.714919 0.920694 1.06018
C  -1.766898 0.02075 -2.011727
C  -4.615197 1.239586 -1.356928
C  -5.411939 0.051949 -1.809914
C  -5.524749 -0.339489 -3.073015
H  3.961815 0.911591 1.069307
H  1.797192 1.697317 0.536945
H  2.249418 -0.16074 -2.736908
H  3.928631 -0.592646 -2.438339
H  2.644888 -1.459032 -1.616891
H  3.665426 2.623108 -0.579454
H  4.603081 1.745026 -1.786039
H  2.97006 2.291494 -2.165223
H  2.957138 -1.982467 0.597508
H  -1.481574 -1.128615 0.660101
H  6.757288 -1.148167 1.939224
H  5.748795 -0.759869 3.314025
H  5.721077 0.271326 1.885714
H  4.883028 -3.241235 3.094849
H  5.781834 -3.496513 1.615084
H  4.028161 -3.699233 1.620143
H  -1.951947 1.404501 2.158531
H  -2.585021 -0.196099 2.525882
H  -2.437264 0.309094 -2.818579
H  -0.820267 0.5461 -2.160197
H  -1.553628 -1.04593 -2.111961
H  -4.182972 1.750379 -2.219704
H  -5.278552 1.957198 -0.865764
H  -5.913089 -0.511704 -1.028187
H  -6.110612 -1.208721 -3.344282
H  -5.042569 0.194646 -3.884113
elementType: O C H
totalener: -965.42652311 hartree
nucrepener: 1782.14909788 hartree
electener: -2747.57562099 hartree
oneelecener: -4850.52007893 hartree
twoeener: 2102.94445794 hartree
cpcmener: -0.02782985 hartree
kineticenergy: 960.98327311 hartree
xcener: -95.136912674095 hartree
chargesum: -0.0000000
charge: -0.295156 -0.467246 -0.451941 0.111428 0.030332 -0.093351 -0.285443 -0.262276 -0.303112 0.377434 -0.042114 0.250011 -0.257690 -0.220346 -0.138372 -0.056395 -0.060163 0.298962 -0.240864 -0.104628 -0.179690 -0.283148 0.113615 0.095341 0.097164 0.099118 0.098058 0.087671 0.094688 0.093574 0.125087 0.104660 0.093560 0.098239 0.088736 0.091522 0.092427 0.088497 0.100520 0.096825 0.097229 0.113143 0.117838 0.103302 0.098634 0.142754 0.129363 0.112201
qa: -0.2952 -0.4672 -0.4519 0.1114 0.0303 -0.0934 -0.2854 -0.2623 -0.3031 0.3774 -0.0421 0.2500 -0.2577 -0.2203 -0.1384 -0.0564 -0.0602 0.2990 -0.2409 -0.1046 -0.1797 -0.2831 0.1136 0.0953 0.0972 0.0991 0.0981 0.0877 0.0947 0.0936 0.1251 0.1047 0.0936 0.0982 0.0887 0.0915 0.0924 0.0885 0.1005 0.0968 0.0972 0.1131 0.1178 0.1033 0.0986 0.1428 0.1294 0.1122
va: 2.1224 2.0213 2.0493 3.7007 3.7521 3.8924 3.9082 3.9084 3.8628 4.1148 3.7653 3.7671 3.9413 3.9248 3.9203 3.7789 3.4178 4.0630 3.9315 3.8688 3.7964 3.9440 1.0049 1.0298 1.0016 1.0020 1.0134 1.0053 1.0015 1.0023 1.0244 1.0313 0.9976 0.9961 1.0118 0.9959 0.9968 1.0089 1.0276 1.0256 1.0082 1.0028 1.0024 1.0036 1.0227 1.0046 1.0040 1.0094
dispcorr: -0.022350960 hartree
energy: -965.448874073298
dipole: 22.62979 -20.62015 2.00964 -4.28848 4.68527 0.39679 -7.90897 6.95350 -0.95547
magnitude: 2.26031 au
magnitude: 5.74525 debye
