program: Orca
programVersion: 5.0.2
elementType: O O O C C C C C C C C C C C C C C C C C C C H H H H H H H H H H H H H H H H H H H H H H H H H H
charge: 0
multiplicity: 1
keywords: wb97x-d3
keywords: def2-TZVPP
keywords: def2/J RIJCOSX
keywords: DEFGRID2
keywords: scfconv7
keywords: smallprint printgap noloewdin
keywords: NOSOSCF
formula: C19H26O3
InChI: InChI=1/C19H26O3/c1-7-8-13-12(4)16(10-15(13)20)22-18(21)17-14(9-11(2)3)19(17,5)6/h7,9,14,16-17H,1,8,10H2,2-6H3
48 atoms
O  -0.275635 0.509811 0.546156
O  0.728236 -1.333506 -0.230304
O  -4.716163 1.081015 1.721545
C  3.085313 0.610926 -0.854426
C  3.38805 0.133593 0.53096
C  1.993332 0.666863 0.198626
C  3.015999 -0.359709 -2.006494
C  3.645688 1.955548 -1.253943
C  3.651244 -1.276391 0.879468
C  0.792544 -0.184513 0.136803
C  4.646707 -1.692262 1.670885
C  -1.568932 -0.099545 0.532932
C  5.656748 -0.787047 2.316295
C  4.807485 -3.145242 2.003512
C  -2.390985 0.383557 1.718112
C  -2.347932 0.33733 -0.684368
C  -3.553236 0.827048 -0.35202
C  -3.707289 0.805126 1.107741
C  -1.792197 0.153506 -2.046265
C  -4.643918 1.283858 -1.271282
C  -5.406158 0.12251 -1.838297
C  -5.514509 -0.14426 -3.133908
H  3.93906 0.848319 1.132199
H  1.790844 1.656272 0.59164
H  2.323306 -0.00208 -2.771472
H  4.001402 -0.436165 -2.470481
H  2.711778 -1.364577 -1.728642
H  4.659066 1.84803 -1.646454
H  3.035563 2.41925 -2.031983
H  3.689093 2.646113 -0.410574
H  2.98632 -2.02844 0.472751
H  -1.4698 -1.187406 0.537181
H  5.824237 0.139749 1.769241
H  6.621792 -1.289741 2.403482
H  5.353955 -0.519298 3.332705
H  5.771201 -3.526054 1.654436
H  4.022376 -3.761675 1.565357
H  4.791372 -3.300414 3.086215
H  -1.929849 1.256359 2.187702
H  -2.528916 -0.371436 2.491758
H  -1.572993 -0.900741 -2.229771
H  -2.474878 0.497027 -2.820394
H  -0.851312 0.6960 -2.164996
H  -4.229638 1.887876 -2.081073
H  -5.327774 1.930314 -0.713815
H  -5.886928 -0.530614 -1.115475
H  -6.077524 -0.99824 -3.489161
H  -5.054053 0.482892 -3.889359
elementType: O C H
totalener: -965.42594384 hartree
nucrepener: 1781.33540024 hartree
electener: -2746.76134408 hartree
oneelecener: -4848.90284148 hartree
twoeener: 2102.14149741 hartree
cpcmener: -0.02775929 hartree
kineticenergy: 960.97998722 hartree
xcener: -95.135757958372 hartree
chargesum: -0.0000000
charge: -0.294512 -0.467122 -0.451378 0.114417 0.040152 -0.101297 -0.285095 -0.262802 -0.320354 0.379403 -0.017147 0.250855 -0.282996 -0.221158 -0.138726 -0.054977 -0.064181 0.299003 -0.240623 -0.102565 -0.180639 -0.283904 0.112899 0.094684 0.097919 0.098225 0.097430 0.094350 0.093101 0.087622 0.123487 0.104409 0.095202 0.094313 0.106014 0.091977 0.087189 0.094548 0.100762 0.096220 0.117770 0.096276 0.113734 0.104744 0.097033 0.143112 0.129667 0.112960
qa: -0.2945 -0.4671 -0.4514 0.1144 0.0402 -0.1013 -0.2851 -0.2628 -0.3204 0.3794 -0.0171 0.2509 -0.2830 -0.2212 -0.1387 -0.0550 -0.0642 0.2990 -0.2406 -0.1026 -0.1806 -0.2839 0.1129 0.0947 0.0979 0.0982 0.0974 0.0943 0.0931 0.0876 0.1235 0.1044 0.0952 0.0943 0.1060 0.0920 0.0872 0.0945 0.1008 0.0962 0.1178 0.0963 0.1137 0.1047 0.0970 0.1431 0.1297 0.1130
va: 2.1221 2.0226 2.0500 3.6953 3.7463 3.9022 3.9085 3.9101 3.8980 4.1121 3.7311 3.7672 3.9462 3.9287 3.9205 3.7799 3.4214 4.0624 3.9324 3.8660 3.7964 3.9422 1.0036 1.0303 1.0011 1.0016 1.0137 1.0018 1.0024 1.0050 1.0244 1.0307 1.0036 0.9997 0.9935 0.9961 1.0096 0.9940 1.0274 1.0258 1.0026 1.0084 1.0030 1.0033 1.0235 1.0041 1.0039 1.0091
dispcorr: -0.022319965 hartree
energy: -965.448263805713
dipole: 22.46384 -20.47900 1.98483 -3.28046 3.78011 0.49965 -7.47144 6.60687 -0.86457
magnitude: 2.22187 au
magnitude: 5.64754 debye
