program: Orca
programVersion: 5.0.2
elementType: O O O C C C C C C C C C C C C C C C C C C C H H H H H H H H H H H H H H H H H H H H H H H H H H
charge: 0
multiplicity: 1
keywords: wb97x-d3
keywords: def2-TZVPP
keywords: def2/J RIJCOSX
keywords: DEFGRID2
keywords: scfconv7
keywords: smallprint printgap noloewdin
keywords: NOSOSCF
formula: C19H26O3
InChI: InChI=1/C19H26O3/c1-7-8-13-12(4)16(10-15(13)20)22-18(21)17-14(9-11(2)3)19(17,5)6/h7,9,14,16-17H,1,8,10H2,2-6H3
48 atoms
O  0.322176 1.191905 0.332322
O  0.904125 1.73577 2.42074
O  -3.840711 1.240335 -1.66055
C  3.251613 1.462037 -0.421488
C  3.019577 0.03011 -0.076263
C  2.605691 1.128404 0.912238
C  2.492315 2.142368 -1.534526
C  4.671207 1.97097 -0.307373
C  2.040695 -0.832154 -0.779727
C  1.20977 1.3878 1.302329
C  1.702723 -2.065026 -0.391903
C  -1.071571 1.374755 0.589193
C  2.232493 -2.717924 0.84917
C  0.741402 -2.895412 -1.184308
C  -1.758894 1.954634 -0.638585
C  -1.749945 0.046904 0.823938
C  -2.829008 -0.102347 0.03843
C  -2.946141 1.049369 -0.864094
C  -1.248517 -0.89366 1.853739
C  -3.791542 -1.24733 0.002334
C  -3.273666 -2.369402 -0.847245
C  -3.072079 -3.608632 -0.415951
H  3.902088 -0.497332 0.274084
H  3.263249 1.235743 1.767176
H  2.374811 3.206903 -1.322689
H  3.061561 2.057176 -2.462678
H  1.504028 1.734696 -1.725803
H  4.688515 3.046138 -0.117299
H  5.218223 1.482624 0.500378
H  5.218994 1.789699 -1.234582
H  1.599163 -0.446312 -1.692761
H  -1.208468 2.017799 1.461292
H  2.694115 -2.016589 1.542768
H  2.977814 -3.479436 0.601629
H  1.433522 -3.235698 1.384854
H  0.423867 -2.40011 -2.102305
H  -0.154463 -3.118138 -0.597355
H  1.180144 -3.860022 -1.454569
H  -1.108627 1.910803 -1.515973
H  -2.068717 2.992508 -0.513737
H  -1.886717 -1.768654 1.958423
H  -0.242911 -1.242524 1.605538
H  -1.176516 -0.401268 2.826034
H  -4.743199 -0.893161 -0.405253
H  -3.996218 -1.60818 1.012218
H  -3.050395 -2.121189 -1.881072
H  -2.697148 -4.38153 -1.074985
H  -3.284453 -3.901234 0.606308
elementType: O C H
totalener: -965.42288466 hartree
nucrepener: 1904.57892460 hartree
electener: -2870.00180926 hartree
oneelecener: -5095.01506739 hartree
twoeener: 2225.01325813 hartree
cpcmener: -0.02881786 hartree
kineticenergy: 960.99475768 hartree
xcener: -95.140657367269 hartree
chargesum: -0.0000000
charge: -0.265037 -0.471615 -0.450704 0.136379 -0.037892 -0.126155 -0.280135 -0.266238 -0.234723 0.402383 -0.050240 0.212457 -0.275239 -0.221451 -0.140767 -0.059312 -0.048574 0.298429 -0.248876 -0.085276 -0.191664 -0.286393 0.111845 0.092121 0.104582 0.099297 0.077931 0.096487 0.087013 0.093879 0.119761 0.110879 0.095261 0.115557 0.093169 0.092258 0.073174 0.105862 0.102180 0.099264 0.101966 0.100832 0.126140 0.096281 0.103532 0.144935 0.133771 0.112665
qa: -0.2650 -0.4716 -0.4507 0.1364 -0.0379 -0.1262 -0.2801 -0.2662 -0.2347 0.4024 -0.0502 0.2125 -0.2752 -0.2215 -0.1408 -0.0593 -0.0486 0.2984 -0.2489 -0.0853 -0.1917 -0.2864 0.1118 0.0921 0.1046 0.0993 0.0779 0.0965 0.0870 0.0939 0.1198 0.1109 0.0953 0.1156 0.0932 0.0923 0.0732 0.1059 0.1022 0.0993 0.1020 0.1008 0.1261 0.0963 0.1035 0.1449 0.1338 0.1127
va: 2.1011 2.0323 2.0537 3.7619 3.7824 3.8741 3.9011 3.9004 3.8261 4.1419 3.7160 3.7506 3.9299 3.9225 3.9182 3.7371 3.3771 4.0745 3.9393 3.8440 3.7890 3.9265 1.0012 1.0280 0.9996 1.0006 1.0128 1.0016 1.0053 1.0023 1.0034 1.0325 1.0028 0.9964 0.9973 1.0079 0.9985 0.9991 1.0247 1.0243 1.0072 0.9943 1.0084 1.0244 1.0061 1.0014 1.0017 1.0110
dispcorr: -0.027441095 hartree
energy: -965.450325752436
dipole: 13.10823 -11.51980 1.58843 -13.17162 12.22309 -0.94853 -2.53178 2.81467 0.28289
magnitude: 1.87158 au
magnitude: 4.75719 debye
