program: Orca
programVersion: 5.0.2
elementType: O O O C C C C C C C C C C C C C C C C C C C H H H H H H H H H H H H H H H H H H H H H H H H H H
charge: 0
multiplicity: 1
keywords: wb97x-d3
keywords: def2-TZVPP
keywords: def2/J RIJCOSX
keywords: DEFGRID2
keywords: scfconv7
keywords: smallprint printgap noloewdin
keywords: NOSOSCF
formula: C19H26O3
InChI: InChI=1/C19H26O3/c1-7-8-13-12(4)16(10-15(13)20)22-18(21)17-14(9-11(2)3)19(17,5)6/h7,9,14,16-17H,1,8,10H2,2-6H3
48 atoms
O  -0.41584 0.424631 0.422012
O  0.613654 -1.548048 0.200959
O  -4.767912 1.43576 1.461323
C  2.88092 0.184119 -1.085007
C  3.262238 0.086264 0.359577
C  1.843168 0.50711 -0.024579
C  2.772652 -1.059347 -1.931698
C  3.394796 1.377602 -1.854546
C  3.572286 -1.189875 1.033913
C  0.65934 -0.340569 0.204877
C  4.658113 -1.403755 1.784253
C  -1.67813 -0.190866 0.698763
C  5.714024 -0.364526 2.047048
C  4.878427 -2.727941 2.450086
C  -2.47343 0.678912 1.661459
C  -2.524039 -0.264734 -0.549839
C  -3.727168 0.302629 -0.369342
C  -3.803247 0.884032 0.97618
C  -2.022135 -0.927724 -1.777668
C  -4.846796 0.409436 -1.346518
C  -4.749415 1.585446 -2.275055
C  -3.755283 2.461993 -2.342741
H  3.836137 0.931483 0.725329
H  1.641038 1.564104 0.103454
H  3.735789 -1.253674 -2.407743
H  2.501072 -1.95351 -1.3785
H  2.037501 -0.923358 -2.727679
H  2.740979 1.613761 -2.696805
H  3.465563 2.268337 -1.228854
H  4.390293 1.174776 -2.255276
H  2.875912 -2.009545 0.91226
H  -1.521259 -1.193633 1.102235
H  5.409061 0.325474 2.83877
H  5.947606 0.235766 1.167357
H  6.643891 -0.828547 2.378307
H  5.80809 -3.191331 2.108594
H  4.063797 -3.426667 2.259302
H  4.974383 -2.611326 3.533443
H  -1.994036 1.648539 1.815284
H  -2.606237 0.222549 2.642959
H  -1.148541 -0.40446 -2.174398
H  -1.707309 -1.951377 -1.566019
H  -2.773328 -0.954207 -2.564879
H  -5.797724 0.470421 -0.808664
H  -4.91795 -0.502236 -1.947427
H  -5.593268 1.69757 -2.949354
H  -3.783848 3.275625 -3.056405
H  -2.883283 2.412222 -1.701465
elementType: O C H
totalener: -965.42572041 hartree
nucrepener: 1800.34888726 hartree
electener: -2765.77460767 hartree
oneelecener: -4887.03832220 hartree
twoeener: 2121.26371453 hartree
cpcmener: -0.02838912 hartree
kineticenergy: 960.98415049 hartree
xcener: -95.138151357146 hartree
chargesum: 0.0000000
charge: -0.295576 -0.469470 -0.446394 0.119497 0.037793 -0.109590 -0.287494 -0.262705 -0.333019 0.385837 -0.002652 0.268794 -0.291456 -0.223693 -0.141429 -0.049673 -0.097203 0.294319 -0.251135 -0.069527 -0.186942 -0.272588 0.114835 0.095264 0.098747 0.098202 0.098685 0.093406 0.087004 0.094318 0.125154 0.106202 0.106812 0.098852 0.095501 0.093091 0.085336 0.097002 0.100404 0.099252 0.112637 0.120989 0.102877 0.091004 0.101257 0.129954 0.130358 0.107162
qa: -0.2956 -0.4695 -0.4464 0.1195 0.0378 -0.1096 -0.2875 -0.2627 -0.3330 0.3858 -0.0027 0.2688 -0.2915 -0.2237 -0.1414 -0.0497 -0.0972 0.2943 -0.2511 -0.0695 -0.1869 -0.2726 0.1148 0.0953 0.0987 0.0982 0.0987 0.0934 0.0870 0.0943 0.1252 0.1062 0.1068 0.0989 0.0955 0.0931 0.0853 0.0970 0.1004 0.0993 0.1126 0.1210 0.1029 0.0910 0.1013 0.1300 0.1304 0.1072
va: 2.1291 2.0188 2.0598 3.6967 3.7470 3.9224 3.9111 3.9107 3.8973 4.1016 3.7009 3.7379 3.9475 3.9282 3.8971 3.7412 3.4454 4.0587 3.9353 3.8325 3.8461 3.9013 1.0002 1.0290 1.0017 1.0129 1.0012 1.0024 1.0054 1.0019 1.0244 1.0292 0.9935 0.9978 1.0026 0.9944 1.0100 0.9931 1.0292 1.0242 0.9978 1.0049 1.0051 1.0202 0.9995 1.0029 1.0044 1.0207
dispcorr: -0.022935647 hartree
energy: -965.448656061566
dipole: 23.61689 -21.86333 1.75356 -3.28852 3.10265 -0.18588 -7.13957 6.12320 -1.01637
magnitude: 2.03532 au
magnitude: 5.17337 debye
