program: Orca
programVersion: 5.0.2
elementType: O O O C C C C C C C C C C C C C C C C C C C H H H H H H H H H H H H H H H H H H H H H H H H H H
charge: 0
multiplicity: 1
keywords: wb97x-d3
keywords: def2-TZVPP
keywords: def2/J RIJCOSX
keywords: DEFGRID2
keywords: scfconv7
keywords: smallprint printgap noloewdin
keywords: NOSOSCF
formula: C19H26O3
InChI: InChI=1/C19H26O3/c1-7-8-13-12(4)16(10-15(13)20)22-18(21)17-14(9-11(2)3)19(17,5)6/h7,9,14,16-17H,1,8,10H2,2-6H3
48 atoms
O  0.422197 1.145268 0.27618
O  0.819675 1.739882 2.395004
O  -3.562206 0.653306 -1.980612
C  3.383772 1.582547 -0.26718
C  3.188661 0.141531 0.063278
C  2.657097 1.222709 1.016365
C  2.679354 2.230411 -1.434102
C  4.769501 2.149089 -0.052455
C  2.299483 -0.754392 -0.712748
C  1.224594 1.407103 1.303815
C  1.993034 -2.008213 -0.368488
C  -0.996102 1.152069 0.451971
C  2.477948 -2.668735 0.886888
C  1.111868 -2.856279 -1.233111
C  -1.67898 1.647764 -0.814948
C  -1.504641 -0.257961 0.645189
C  -2.473928 -0.559282 -0.233726
C  -2.701585 0.58155 -1.129606
C  -0.975799 -1.109462 1.737786
C  -3.310366 -1.795508 -0.32316
C  -4.596814 -1.613314 0.428818
C  -5.79882 -1.561075 -0.130573
H  4.063707 -0.351127 0.477015
H  3.24419 1.36022 1.917064
H  2.537552 3.296698 -1.247848
H  3.299344 2.136162 -2.327955
H  1.70759 1.806997 -1.669619
H  4.729587 3.224332 0.133744
H  5.27521 1.684334 0.795085
H  5.389768 1.987969 -0.936583
H  1.896194 -0.370897 -1.644134
H  -1.263086 1.766569 1.314467
H  2.869953 -1.966626 1.62159
H  3.26782 -3.393275 0.666508
H  1.671801 -3.231747 1.363292
H  0.198915 -3.138337 -0.700439
H  1.607112 -3.791886 -1.507722
H  0.819969 -2.347165 -2.15187
H  -0.974796 1.720421 -1.647514
H  -2.148604 2.624703 -0.698619
H  -1.157567 -0.640998 2.707891
H  -1.431282 -2.097733 1.749792
H  0.10467 -1.240278 1.651002
H  -2.763499 -2.648337 0.085805
H  -3.519483 -2.024048 -1.370549
H  -4.501048 -1.500823 1.505333
H  -6.691864 -1.418693 0.46514
H  -5.937933 -1.661822 -1.200909
elementType: O C H
totalener: -965.42285316 hartree
nucrepener: 1890.72852603 hartree
electener: -2856.15137919 hartree
oneelecener: -5067.34097639 hartree
twoeener: 2211.18959720 hartree
cpcmener: -0.03099822 hartree
kineticenergy: 960.99331577 hartree
xcener: -95.139846305915 hartree
chargesum: 0.0000000
charge: -0.264421 -0.469960 -0.447284 0.135021 -0.036103 -0.122265 -0.279532 -0.265678 -0.233709 0.394276 -0.046826 0.218823 -0.280207 -0.234070 -0.141361 -0.033644 -0.069228 0.290169 -0.263060 -0.108119 -0.179235 -0.274656 0.111093 0.091727 0.102990 0.100061 0.079795 0.096386 0.087104 0.093934 0.118467 0.112058 0.095791 0.116452 0.093986 0.085972 0.106136 0.091688 0.102957 0.099474 0.129143 0.108511 0.102603 0.106907 0.097704 0.140211 0.128213 0.111706
qa: -0.2644 -0.4700 -0.4473 0.1350 -0.0361 -0.1223 -0.2795 -0.2657 -0.2337 0.3943 -0.0468 0.2188 -0.2802 -0.2341 -0.1414 -0.0336 -0.0692 0.2902 -0.2631 -0.1081 -0.1792 -0.2747 0.1111 0.0917 0.1030 0.1001 0.0798 0.0964 0.0871 0.0939 0.1185 0.1121 0.0958 0.1165 0.0940 0.0860 0.1061 0.0917 0.1030 0.0995 0.1291 0.1085 0.1026 0.1069 0.0977 0.1402 0.1282 0.1117
va: 2.1010 2.0335 2.0553 3.7683 3.7764 3.8718 3.9017 3.8991 3.8267 4.1455 3.7062 3.7607 3.9270 3.9239 3.9314 3.6912 3.3890 4.0820 3.9467 3.8693 3.7954 3.9551 1.0013 1.0283 1.0004 0.9998 1.0127 1.0018 1.0051 1.0024 1.0035 1.0324 1.0019 0.9969 0.9971 0.9949 0.9972 1.0070 1.0244 1.0248 1.0034 1.0028 0.9917 1.0066 1.0197 1.0010 1.0031 1.0136
dispcorr: -0.026833322 hartree
energy: -965.449686486073
dipole: 11.80140 -9.99741 1.80399 -10.29492 9.36283 -0.93209 -1.27837 1.68335 0.40498
magnitude: 2.07055 au
magnitude: 5.26292 debye
